PFR,UniProt Id,Entry Accession,Entry Description,Isoform Accession,Isoform Description,Isoform Sequence,Start,End,Length,Proteoform Sequence,Monoisotopic Mass,Average Mass,Sequence Modifications,PTMs,N-Terminal,C-Terminal,Star
1001,HINT1_HUMAN,P49773,Histidine triad nucleotide-binding protein 1,P49773,,MADEIAKAQVARPGGDTIFGKIIRKEIPAKIIFEDDRCLAFHDISPQAPTHFLVIPKKHISQISVAEDDDESLLGHLMIVGKKCAADLGLNKGYRMVVNEGSDGGQSVYHVHLHVLGGRQMHWPPG,1,125,125,ADEIAKAQVARPGGDTIFGKIIRKEIPAKIIFEDDRCLAFHDISPQAPTHFLVIPKKHISQISVAEDDDESLLGHLMIVGKKCAADLGLNKGYRMVVNEGSDGGQSVYHVHLHVLGGRQMHWPPG,13704.06364969,13712.75538,,RESID:41@0,,,1
1002,BAF_HUMAN,O75531,Barrier-to-autointegration factor,O75531,,MTTSQKHRDFVAEPMGEKPVGSLAGIGEVLGKKLEERGFDKAYVVLGQFLVLKKDEDLFREWLKDTCGANAKQSRDCFGCLREWCDAFL,1,88,88,TTSQKHRDFVAEPMGEKPVGSLAGIGEVLGKKLEERGFDKAYVVLGQFLVLKKDEDLFREWLKDTCGANAKQSRDCFGCLREWCDAFL,9962.99342969,9969.42288,,RESID:52@0,,,1
1003,CH10_HUMAN,P61604,10 kDa heat shock protein; mitochondrial,P61604,,MAGQAFRKFLPLFDRVLVERSAAETVTKGGIMLPEKSQGKVLQATVVAVGSGSKGKGGEIQPVSVKVGDKVLLPEYGGTKVVLDDKDYFLFRDGDILGKYVD,1,101,101,AGQAFRKFLPLFDRVLVERSAAETVTKGGIMLPEKSQGKVLQATVVAVGSGSKGKGGEIQPVSVKVGDKVLLPEYGGTKVVLDDKDYFLFRDGDILGKYVD,10835.84097969,10842.53928,,RESID:41@0,,,3
1004,ERH_HUMAN,P84090,Enhancer of rudimentary homolog,P84090,,MSHTILLVQPTKRPEGRTYADYESVNECMEGVCKMYEEHLKRMNPNSPSITYDISQLFDFIDDLADLSCLVYRADTQTYQPYNKDWIKEKIYVLLRRQAQQAGK,1,103,103,SHTILLVQPTKRPEGRTYADYESVNECMEGVCKMYEEHLKRMNPNSPSITYDISQLFDFIDDLADLSCLVYRADTQTYQPYNKDWIKEKIYVLLRRQAQQAGK,12161.97250969,12169.78418,,RESID:51@0,,,1
1005,RUXF_HUMAN,P62306,Small nuclear ribonucleoprotein F,P62306,,MSLPLNPKPFLNGLTGKPVMVKLKWGMEYKGYLVSVDGYMNMQLANTEEYIDGALSGHLGEVLIRCNNVLYIRGVEEEEEDGEMRE,1,85,85,SLPLNPKPFLNGLTGKPVMVKLKWGMEYKGYLVSVDGYMNMQLANTEEYIDGALSGHLGEVLIRCNNVLYIRGVEEEEEDGEMRE,9629.74666968999,9636.03878,,RESID:51@0,,,1
1006,HMGN2_HUMAN,P05204,Non-histone chromosomal protein HMG-17,P05204,,MPKRKAEGDAKGDKAKVKDEPQRRSARLSAKPAPPKPEPKPKKAPAKKGEKVPKGKKGKADAGKEGNNPAENGDAKTDQAQKAEGAGDAK,1,89,89,PKRKAEGDAKGDKAKVKDEPQRRSARLSAKPAPPKPEPKPKKAPAKKGEKVPKGKKGKADAGKEGNNPAENGDAKTDQAQKAEGAGDAK,9256.01670469,9261.47728,,,,,1
1007,THIO_HUMAN,P10599,Thioredoxin,P10599-1,1,MVKQIESKTAFQEALDAAGDKLVVVDFSATWCGPCKMIKPFFHSLSEKYSNVIFLEVDVDDCQDVASECEVKCMPTFQFFKKGQKVGEFSGANKEKLEATINELV,1,104,104,VKQIESKTAFQEALDAAGDKLVVVDFSATWCGPCKMIKPFFHSLSEKYSNVIFLEVDVDDCQDVASECEVKCMPTFQFFKKGQKVGEFSGANKEKLEATINELV,11598.70092469,11606.30388,,,,,1
1009,ATP5L_HUMAN,O75964,ATP synthase subunit g; mitochondrial,O75964,,MAQFVRNLVEKTPALVNAAVTYSKPRLATFWYYAKVELVPPTPAEIPRAIQSLKKIVNSAQTGSFKQLTVKEAVLNGLVATEVLMWFYVGEIIGKRGIIGYDV,1,102,102,AQFVRNLVEKTPALVNAAVTYSKPRLATFWYYAKVELVPPTPAEIPRAIQSLKKIVNSAQTGSFKQLTVKEAVLNGLVATEVLMWFYVGEIIGKRGIIGYDV,11332.21286969,11339.32418,,RESID:41@0,,,3
1010,S10AA_HUMAN,P60903,Protein S100-A10,P60903,,MPSQMEHAMETMMFTFHKFAGDKGYLTKEDLRVLMEKEFPGFLENQKDPLAVDKIMKDLDQCRDGKVGFQSFFSLIAGLTIACNDYFVVHMKQKGKK,1,96,96,PSQMEHAMETMMFTFHKFAGDKGYLTKEDLRVLMEKEFPGFLENQKDPLAVDKIMKDLDQCRDGKVGFQSFFSLIAGLTIACNDYFVVHMKQKGKK,11064.47058469,11071.91168,,,,,1
1011,NEDD8_HUMAN,Q15843,NEDD8,Q15843,,MLIKVKTLTGKEIEIDIEPTDKVERIKERVEEKEGIPPQQQRLIYSGKQMNDEKTAADYKILGGSVLHLVLALRGGGGLRQ,0,75,76,MLIKVKTLTGKEIEIDIEPTDKVERIKERVEEKEGIPPQQQRLIYSGKQMNDEKTAADYKILGGSVLHLVLALRGG,8554.66613469,8559.97098,,,,,1
1012,RL30_HUMAN,P62888,60S ribosomal protein L30,P62888,,MVAAKKTKKSLESINSRLQLVMKSGKYVLGYKQTLKMIRQGKAKLVILANNCPALRKSEIEYYAMLAKTGVHHYSGNNIELGTACGKYYRVCTLAIIDPGDSDIIRSMPEQTGEK,1,114,114,VAAKKTKKSLESINSRLQLVMKSGKYVLGYKQTLKMIRQGKAKLVILANNCPALRKSEIEYYAMLAKTGVHHYSGNNIELGTACGKYYRVCTLAIIDPGDSDIIRSMPEQTGEK,12644.70093469,12652.85798,,,,,3
1013,SH3L1_HUMAN,O75368,SH3 domain-binding glutamic acid-rich-like protein,O75368,,MVIRVYIASSSGSTAIKKKQQDVLGFLEANKIGFEEKDIAANEENRKWMRENVPENSRPATGYPLPPQIFNESQYRGDYDAFFEARENNAVYAFLGLTAPPGSKEAEVQAKQQA,1,113,113,VIRVYIASSSGSTAIKKKQQDVLGFLEANKIGFEEKDIAANEENRKWMRENVPENSRPATGYPLPPQIFNESQYRGDYDAFFEARENNAVYAFLGLTAPPGSKEAEVQAKQQA,12635.33760469,12643.05928,,,,,1
1014,HCD2_HUMAN,Q99714,3-hydroxyacyl-CoA dehydrogenase type-2,Q99714-1,1,MAAACRSVKGLVAVITGGASGLGLATAERLVGQGASAVLLDLPNSGGEAQAKKLGNNCVFAPADVTSEKDVQTALALAKGKFGRVDVAVNCAGIAVASKTYNLKKGQTHTLEDFQRVLDVNLMGTFNVIRLVAGEMGQNEPDQGGQRGVIINTASVAAFEGQVGQAAYSASKGGIVGMTLPIARDLAPIGIRVMTIAPGLFGTPLLTSLPEKVCNFLASQVPFPSRLGDPAEYAHLVQAIIENPFLNGEVIRLDGAIRMQP,1,260,260,AAACRSVKGLVAVITGGASGLGLATAERLVGQGASAVLLDLPNSGGEAQAKKLGNNCVFAPADVTSEKDVQTALALAKGKFGRVDVAVNCAGIAVASKTYNLKKGQTHTLEDFQRVLDVNLMGTFNVIRLVAGEMGQNEPDQGGQRGVIINTASVAAFEGQVGQAAYSASKGGIVGMTLPIARDLAPIGIRVMTIAPGLFGTPLLTSLPEKVCNFLASQVPFPSRLGDPAEYAHLVQAIIENPFLNGEVIRLDGAIRMQP,26817.08203969,26833.93158,,RESID:41@0,,,1
1015,B2MG_HUMAN,P61769,Beta-2-microglobulin,P61769,,MSRSVALAVLALLSLSGLEAIQRTPKIQVYSRHPAENGKSNFLNCYVSGFHPSDIEVDLLKNGERIEKVEHSDLSFSKDWSFYLLYYTEFTPTEKDEYACRVNHVTLSQPKIVKWDRDM,20,118,99,IQRTPKIQVYSRHPAENGKSNFLNCYVSGFHPSDIEVDLLKNGERIEKVEHSDLSFSKDWSFYLLYYTEFTPTEKDEYACRVNHVTLSQPKIVKWDRDM,11723.78730469,11731.16798,,,,,1
1016,LSM8_HUMAN,O95777,U6 snRNA-associated Sm-like protein LSm8,O95777,,MTSALENYINRTVAVITSDGRMIVGTLKGFDQTINLILDESHERVFSSSQGVEQVVLGLYIVRGDNVAVIGEIDEETDSALDLGNIRAEPLNSVAH,1,95,95,TSALENYINRTVAVITSDGRMIVGTLKGFDQTINLILDESHERVFSSSQGVEQVVLGLYIVRGDNVAVIGEIDEETDSALDLGNIRAEPLNSVAH,10307.26105969,10313.49468,,RESID:52@0,,,1
1017,S10AB_HUMAN,P31949,Protein S100-A11,P31949,,MAKISSPTETERCIESLIAVFQKYAGKDGYNYTLSKTEFLSFMNTELAAFTKNQKDPGVLDRMMKKLDTNSDGQLDFSEFLNLIGGLAMACHDSFLKAVPSQKRT,1,104,104,AKISSPTETERCIESLIAVFQKYAGKDGYNYTLSKTEFLSFMNTELAAFTKNQKDPGVLDRMMKKLDTNSDGQLDFSEFLNLIGGLAMACHDSFLKAVPSQKRT,11643.79501969,11651.29238,,RESID:41@0,,,3
1018,CX7A2_HUMAN,P14406,Cytochrome c oxidase subunit 7A2; mitochondrial,P14406,,MLRNLLALRQIGQRTISTASRRHFKNKVPEKQKLFQEDDEIPLYLKGGVADALLYRATMILTVGGTAYAIYELAVASFPKKQE,23,82,60,FKNKVPEKQKLFQEDDEIPLYLKGGVADALLYRATMILTVGGTAYAIYELAVASFPKKQE,6717.58107469,6721.81428,,,,,3
1019,DPM3_HUMAN,Q9P2X0,Dolichol-phosphate mannosyltransferase subunit 3,Q9P2X0-1,1,MTKLAQWLWGLAILGSTWVALTTGALGLELPLSCQEVLWPLPAYLLVSAGCYALGTVGYRVATFHDCEDAARELQSQIQEARADLARRGLRF,0,91,92,MTKLAQWLWGLAILGSTWVALTTGALGLELPLSCQEVLWPLPAYLLVSAGCYALGTVGYRVATFHDCEDAARELQSQIQEARADLARRGLRF,10087.23565469,10093.71998,,,,,1
1020,RLA2_HUMAN,P05387,60S acidic ribosomal protein P2,P05387,,MRYVASYLLAALGGNSSPSAKDIKKILDSVGIEADDDRLNKVISELNGKNIEDVIAQGIGKLASVPAGGAVAVSAAPGSAAPAAGSAPAAAEEKKDEKKEESEESDDDMGFGLFD,0,114,115,MRYVASYLLAALGGNSSPSAKDIKKILDSVGIEADDDRLNKVISELNGKNIEDVIAQGIGKLASVPAGGAVAVSAAPGSAAPAAGSAPAAAEEKKDEKKEESEESDDDMGFGLFD,11817.77969669,11824.89708,,RESID:37@101|RESID:37@104,,,1
1021,COX5A_HUMAN,P20674,Cytochrome c oxidase subunit 5A; mitochondrial,P20674,,MLGAALRRCAVAATTRADPRGLLHSARTPGPAVAIQSVRCYSHGSQETDEEFDARWVTYFNKPDIDAWELRKGINTLVTYDMVPEPKIIDAALRACRRLNDFASTVRILEVVKDKAGPHKEIYPYVIQELRPTLNELGISTPEELGLDKV,41,149,109,SHGSQETDEEFDARWVTYFNKPDIDAWELRKGINTLVTYDMVPEPKIIDAALRACRRLNDFASTVRILEVVKDKAGPHKEIYPYVIQELRPTLNELGISTPEELGLDKV,12493.42618469,12501.17128,,,,,1
1022,HMGN1_HUMAN,P05114,Non-histone chromosomal protein HMG-14,P05114,,MPKRKVSSAEGAAKEEPKRRSARLSAKPPAKVEAKPKKAAAKDKSSDKKVQTKGKRGAKGKQAEVANQETKEDLPAENGETKTEESPASDEAGEKEAKSD,1,99,99,PKRKVSSAEGAAKEEPKRRSARLSAKPPAKVEAKPKKAAAKDKSSDKKVQTKGKRGAKGKQAEVANQETKEDLPAENGETKTEESPASDEAGEKEAKSD,10521.55253469,10527.70988,,,,,1
1023,NH2L1_HUMAN,P55769,NHP2-like protein 1,P55769,,MTEADVNPKAYPLADAHLTKKLLDLVQQSCNYKQLRKGANEATKTLNRGISEFIVMAADAEPLEIILHLPLLCEDKNVPYVFVRSKQALGRACGVSRPVIACSVTIKEGSQLKQQIQSIQQSIERLLV,1,127,127,TEADVNPKAYPLADAHLTKKLLDLVQQSCNYKQLRKGANEATKTLNRGISEFIVMAADAEPLEIILHLPLLCEDKNVPYVFVRSKQALGRACGVSRPVIACSVTIKEGSQLKQQIQSIQQSIERLLV,14075.52455969,14084.39288,,RESID:52@0,,,1
1024,HDGF_HUMAN,P51858,Hepatoma-derived growth factor,P51858-1,1,MSRSNRQKEYKCGDLVFAKMKGYPHWPARIDEMPEAAVKSTANKYQVFFFGTHETAFLGPKDLFPYEESKEKFGKPNKRKGFSEGLWEIENNPTVKASGYQSSQKKSCVEEPEPEPEAAEGDGDKKGNAEGSSDEEGKLVIDEPAKEKNEKGALKRRAGDLLEDSPKRPKEAENPEGEEKEAATLEVERPLPMEVEKNSTPSEPGSGRGPPQEEEEEEDEEEEATKEDAEAPGIRDHESL,1,239,239,SRSNRQKEYKCGDLVFAKMKGYPHWPARIDEMPEAAVKSTANKYQVFFFGTHETAFLGPKDLFPYEESKEKFGKPNKRKGFSEGLWEIENNPTVKASGYQSSQKKSCVEEPEPEPEAAEGDGDKKGNAEGSSDEEGKLVIDEPAKEKNEKGALKRRAGDLLEDSPKRPKEAENPEGEEKEAATLEVERPLPMEVEKNSTPSEPGSGRGPPQEEEEEEDEEEEATKEDAEAPGIRDHESL,26682.83622969,26699.13288,,RESID:51@0,,,1
1025,SSRB_HUMAN,P43308,Translocon-associated protein subunit beta,P43308,,MRLLSFVVLALFAVTQAEEGARLLASKSLLNRYAVEGRDLTLQYNIYNVGSSAALDVELSDDSFPPEDFGIVSGMLNVKWDRIAPASNVSHTVVLRPLKAGYFNFTSATITYLAQEDGPVVIGSTSAPGQGGILAQREFDRRFSPHFLDWAAFGVMTLPSIGIPLLLWYSSKRKYDTPKTKKN,17,182,166,EEGARLLASKSLLNRYAVEGRDLTLQYNIYNVGSSAALDVELSDDSFPPEDFGIVSGMLNVKWDRIAPASNVSHTVVLRPLKAGYFNFTSATITYLAQEDGPVVIGSTSAPGQGGILAQREFDRRFSPHFLDWAAFGVMTLPSIGIPLLLWYSSKRKYDTPKTKKN,18262.41570469,18273.73628,,,,,1
1026,PTMS_HUMAN,P20962,Parathymosin,P20962,,MSEKSVEAAAELSAKDLKEKKEKVEEKASRKERKKEVVEEEENGAEEEEEETAEDGEEEDEGEEEDEEEEEEDDEGPALKRAAEEEDEADPKRQKTENGASA,1,101,101,SEKSVEAAAELSAKDLKEKKEKVEEKASRKERKKEVVEEEENGAEEEEEETAEDGEEEDEGEEEDEEEEEEDDEGPALKRAAEEEDEADPKRQKTENGASA,11434.15759969,11440.74728,,RESID:51@0,,,3
1027,TMA7_HUMAN,Q9Y2S6,Translation machinery-associated protein 7,Q9Y2S6,,MSGREGGKKKPLKQPKKQAKEMDEEDKAFKQKQKEEQKKLEELKAKAAGKGPLATGGIKKSGKK,1,63,63,SGREGGKKKPLKQPKKQAKEMDEEDKAFKQKQKEEQKKLEELKAKAAGKGPLATGGIKKSGKK,6972.90249969,6977.14528000001,,RESID:51@0,,,3
1028,ATPD_HUMAN,P30049,ATP synthase subunit delta; mitochondrial,P30049,,MLPAALLRRPGLGRLVRHARAYAEAAAAPAAASGPNQMSFTFASPTQVFFNGANVRQVDVPTLTGAFGILAAHVPTLQVLRPGLVVVHAEDGTTSKYFVSSGSIAVNADSSVQLLAEEAVTLDMLDLGAAKANLEKAQAELVGTADEATRAEIQIRIEANEALVKALE,22,167,146,AEAAAAPAAASGPNQMSFTFASPTQVFFNGANVRQVDVPTLTGAFGILAAHVPTLQVLRPGLVVVHAEDGTTSKYFVSSGSIAVNADSSVQLLAEEAVTLDMLDLGAAKANLEKAQAELVGTADEATRAEIQIRIEANEALVKALE,15010.73945469,15019.92938,,,,,1
1029,NDUAB_HUMAN,Q86Y39,NADH dehydrogenase [ubiquinone] 1 alpha subcomplex subunit 11,Q86Y39-1,1,MAPKVFRQYWDIPDGTDCHRKAYSTTSIASVAGLTAAAYRVTLNPPGTFLEGVAKVGQYTFTAAAVGAVFGLTTCISAHVREKPDDPLNYFLGGCAGGLTLGARTHNYGIGAAACVYFGIAASLVKMGRLEGWEVFAKPKV,1,140,140,APKVFRQYWDIPDGTDCHRKAYSTTSIASVAGLTAAAYRVTLNPPGTFLEGVAKVGQYTFTAAAVGAVFGLTTCISAHVREKPDDPLNYFLGGCAGGLTLGARTHNYGIGAAACVYFGIAASLVKMGRLEGWEVFAKPKV,14711.49531469,14720.89088,,,,,1
1030,TAGL2_HUMAN,P37802,Transgelin-2,P37802-1,1,MANRGPAYGLSREVQQKIEKQYDADLEQILIQWITTQCRKDVGRPQPGRENFQNWLKDGTVLCELINALYPEGQAPVKKIQASTMAFKQMEQISQFLQAAERYGINTTDIFQTVDLWEGKNMACVQRTLMNLGGLAVARDDGLFSGDPNWFPKKSKENPRNFSDNQLQEGKNVIGLQMGTNRGASQAGMTGYGMPRQIL,1,198,198,ANRGPAYGLSREVQQKIEKQYDADLEQILIQWITTQCRKDVGRPQPGRENFQNWLKDGTVLCELINALYPEGQAPVKKIQASTMAFKQMEQISQFLQAAERYGINTTDIFQTVDLWEGKNMACVQRTLMNLGGLAVARDDGLFSGDPNWFPKKSKENPRNFSDNQLQEGKNVIGLQMGTNRGASQAGMTGYGMPRQIL,22288.14280969,22302.29378,,RESID:41@0,,,1
1035,LDHA_HUMAN,P00338,L-lactate dehydrogenase A chain,P00338-1,1,MATLKDQLIYNLLKEEQTPQNKITVVGVGAVGMACAISILMKDLADELALVDVIEDKLKGEMMDLQHGSLFLRTPKIVSGKDYNVTANSKLVIITAGARQQEGESRLNLVQRNVNIFKFIIPNVVKYSPNCKLLIVSNPVDILTYVAWKISGFPKNRVIGSGCNLDSARFRYLMGERLGVHPLSCHGWVLGEHGDSSVPVWSGMNVAGVSLKTLHPDLGTDKDKEQWKEVHKQVVESAYEVIKLKGYTSWAIGLSVADLAESIMKNLRRVHPVSTMIKGLYGIKDDVFLSVPCILGQNGISDLVKVTLTSEEEARLKKSADTLWGIQKELQF,1,331,331,ATLKDQLIYNLLKEEQTPQNKITVVGVGAVGMACAISILMKDLADELALVDVIEDKLKGEMMDLQHGSLFLRTPKIVSGKDYNVTANSKLVIITAGARQQEGESRLNLVQRNVNIFKFIIPNVVKYSPNCKLLIVSNPVDILTYVAWKISGFPKNRVIGSGCNLDSARFRYLMGERLGVHPLSCHGWVLGEHGDSSVPVWSGMNVAGVSLKTLHPDLGTDKDKEQWKEVHKQVVESAYEVIKLKGYTSWAIGLSVADLAESIMKNLRRVHPVSTMIKGLYGIKDDVFLSVPCILGQNGISDLVKVTLTSEEEARLKKSADTLWGIQKELQF,36576.33041969,36599.56918,,RESID:41@0,,,1
1036,PTMA_HUMAN,P06454,Prothymosin alpha,P06454-2,2,MSDAAVDTSSEITTKDLKEKKEVVEEAENGRDAPANGNANEENGEQEADNEVDEEEEEGGEEEEEEEEGDGEEEDGDEDEEAESATGKRAAEDDEDDDVDTKKQKTDEDD,1,109,109,SDAAVDTSSEITTKDLKEKKEVVEEAENGRDAPANGNANEENGEQEADNEVDEEEEEGGEEEEEEEEGDGEEEDGDEDEEAESATGKRAAEDDEDDDVDTKKQKTDEDD,11977.89616969,11984.69348,,RESID:51@0,,,1
1038,TYB10_HUMAN,P63313,Thymosin beta-10,P63313,,MADKPDMGEIASFDKAKLKKTETQEKNTLPTKETIEQEKRSEIS,1,43,43,ADKPDMGEIASFDKAKLKKTETQEKNTLPTKETIEQEKRSEIS,4933.52295969,4936.52308,,RESID:41@0,,,1
1040,ACTB_HUMAN,P60709,Actin; cytoplasmic 1,P60709,,MDDDIAALVVDNGSGMCKAGFAGDDAPRAVFPSIVGRPRHQGVMVGMGQKDSYVGDEAQSKRGILTLKYPIEHGIVTNWDDMEKIWHHTFYNELRVAPEEHPVLLTEAPLNPKANREKMTQIMFETFNTPAMYVAIQAVLSLYASGRTTGIVMDSGDGVTHTVPIYEGYALPHAILRLDLAGRDLTDYLMKILTERGYSFTTTAEREIVRDIKEKLCYVALDFEQEMATAASSSSLEKSYELPDGQVITIGNERFRCPEALFQPSFLGMESCGIHETTFNSIMKCDVDIRKDLYANTVLSGGTTMYPGIADRMQKEITALAPSTMKIKIIAPPERKYSVWIGGSILASLSTFQQMWISKQEYDESGPSIVHRKCF,1,374,374,DDDIAALVVDNGSGMCKAGFAGDDAPRAVFPSIVGRPRHQGVMVGMGQKDSYVGDEAQSKRGILTLKYPIEHGIVTNWDDMEKIWHHTFYNELRVAPEEHPVLLTEAPLNPKANREKMTQIMFETFNTPAMYVAIQAVLSLYASGRTTGIVMDSGDGVTHTVPIYEGYALPHAILRLDLAGRDLTDYLMKILTERGYSFTTTAEREIVRDIKEKLCYVALDFEQEMATAASSSSLEKSYELPDGQVITIGNERFRCPEALFQPSFLGMESCGIHETTFNSIMKCDVDIRKDLYANTVLSGGTTMYPGIADRMQKEITALAPSTMKIKIIAPPERKYSVWIGGSILASLSTFQQMWISKQEYDESGPSIVHRKCF,41578.68902469,41605.54198,,,,,1
1042,LDHB_HUMAN,P07195,L-lactate dehydrogenase B chain,P07195,,MATLKEKLIAPVAEEEATVPNNKITVVGVGQVGMACAISILGKSLADELALVDVLEDKLKGEMMDLQHGSLFLQTPKIVADKDYSVTANSKIVVVTAGVRQQEGESRLNLVQRNVNVFKFIIPQIVKYSPDCIIIVVSNPVDILTYVTWKLSGLPKHRVIGSGCNLDSARFRYLMAEKLGIHPSSCHGWILGEHGDSSVAVWSGVNVAGVSLQELNPEMGTDNDSENWKEVHKMVVESAYEVIKLKGYTNWAIGLSVADLIESMLKNLSRIHPVSTMVKGMYGIENEVFLSLPCILNARGLTSVINQKLKDDEVAQLKKSADTLWDIQKDLKDL,1,333,333,ATLKEKLIAPVAEEEATVPNNKITVVGVGQVGMACAISILGKSLADELALVDVLEDKLKGEMMDLQHGSLFLQTPKIVADKDYSVTANSKIVVVTAGVRQQEGESRLNLVQRNVNVFKFIIPQIVKYSPDCIIIVVSNPVDILTYVTWKLSGLPKHRVIGSGCNLDSARFRYLMAEKLGIHPSSCHGWILGEHGDSSVAVWSGVNVAGVSLQELNPEMGTDNDSENWKEVHKMVVESAYEVIKLKGYTNWAIGLSVADLIESMLKNLSRIHPVSTMVKGMYGIENEVFLSLPCILNARGLTSVINQKLKDDEVAQLKKSADTLWDIQKDLKDL,36526.11240969,36549.33688,,RESID:41@0,,,1
1043,RS27A_HUMAN,P62979,Ubiquitin-40S ribosomal protein S27a,P62979,,MQIFVKTLTGKTITLEVEPSDTIENVKAKIQDKEGIPPDQQRLIFAGKQLEDGRTLSDYNIQKESTLHLVLRLRGGAKKRKKKSYTTPKKNKHKRKKVKLAVLKYYKVDENGKISRLRRECPSDECGAGVFMASHFDRHYCGKCCLTYCFNKPEDK,76,155,80,AKKRKKKSYTTPKKNKHKRKKVKLAVLKYYKVDENGKISRLRRECPSDECGAGVFMASHFDRHYCGKCCLTYCFNKPEDK,9411.88531469,9418.08878,,,,,1
1044,TCTP_HUMAN,P13693,Translationally-controlled tumor protein,P13693-1,1,MIIYRDLISHDEMFSDIYKIREIADGLCLEVEGKMVSRTEGNIDDSLIGGNASAEGPEGEGTESTVITGVDIVMNHHLQETSFTKEAYKKYIKDYMKSIKGKLEEQRPERVKPFMTGAAEQIKHILANFKNYQFFIGENMNPDGMVALLDYREDGVTPYMIFFKDGLEMEKC,0,171,172,MIIYRDLISHDEMFSDIYKIREIADGLCLEVEGKMVSRTEGNIDDSLIGGNASAEGPEGEGTESTVITGVDIVMNHHLQETSFTKEAYKKYIKDYMKSIKGKLEEQRPERVKPFMTGAAEQIKHILANFKNYQFFIGENMNPDGMVALLDYREDGVTPYMIFFKDGLEMEKC,19582.57992469,19595.33758,,,,,1
1045,SGMR1_HUMAN,Q99720,Sigma non-opioid intracellular receptor 1,Q99720-3,3,MQWAVGRRWAWAALLLAVAAVLTQVVWLWLGTQSFVFQREEIAQLARQYAGLDHELAFSRLIVELRRLHPGHVLPDEELQWVFVNAGGWMGAMCLLHASLSEYVLLFGTALGSRGHSGETVVHGPGEATAVEWGPNTWMVEYGRGVIPSTLAFALADTVFSTQDFLTLFYTLRSYARGLRLELTTYLFGQDP,0,191,192,MQWAVGRRWAWAALLLAVAAVLTQVVWLWLGTQSFVFQREEIAQLARQYAGLDHELAFSRLIVELRRLHPGHVLPDEELQWVFVNAGGWMGAMCLLHASLSEYVLLFGTALGSRGHSGETVVHGPGEATAVEWGPNTWMVEYGRGVIPSTLAFALADTVFSTQDFLTLFYTLRSYARGLRLELTTYLFGQDP,21469.02837469,21482.68908,,,,,1
1046,RL38_HUMAN,P63173,60S ribosomal protein L38,P63173,,MPRKIEEIKDFLLTARRKDAKSVKIKKNKDNVKFKVRCSRYLYTLVITDKEKAEKLKQSLPPGLAVKELK,1,69,69,PRKIEEIKDFLLTARRKDAKSVKIKKNKDNVKFKVRCSRYLYTLVITDKEKAEKLKQSLPPGLAVKELK,8081.69137469,8086.69548,,,,,3
1047,SGMR1_HUMAN,Q99720,Sigma non-opioid intracellular receptor 1,Q99720-1,1,MQWAVGRRWAWAALLLAVAAVLTQVVWLWLGTQSFVFQREEIAQLARQYAGLDHELAFSRLIVELRRLHPGHVLPDEELQWVFVNAGGWMGAMCLLHASLSEYVLLFGTALGSRGHSGRYWAEISDTIISGTFHQWREGTTKSEVFYPGETVVHGPGEATAVEWGPNTWMVEYGRGVIPSTLAFALADTVFSTQDFLTLFYTLRSYARGLRLELTTYLFGQDP,0,222,223,MQWAVGRRWAWAALLLAVAAVLTQVVWLWLGTQSFVFQREEIAQLARQYAGLDHELAFSRLIVELRRLHPGHVLPDEELQWVFVNAGGWMGAMCLLHASLSEYVLLFGTALGSRGHSGRYWAEISDTIISGTFHQWREGTTKSEVFYPGETVVHGPGEATAVEWGPNTWMVEYGRGVIPSTLAFALADTVFSTQDFLTLFYTLRSYARGLRLELTTYLFGQDP,25111.78150469,25127.69368,,,,,1
1048,PRDX1_HUMAN,Q06830,Peroxiredoxin-1,Q06830,,MSSGNAKIGHPAPNFKATAVMPDGQFKDISLSDYKGKYVVFFFYPLDFTFVCPTEIIAFSDRAEEFKKLNCQVIGASVDSHFCHLAWVNTPKKQGGLGPMNIPLVSDPKRTIAQDYGVLKADEGISFRGLFIIDDKGILRQITVNDLPVGRSVDETLRLVQAFQFTDKHGEVCPAGWKPGSDTIKPDVQKSKEYFSKQK,1,198,198,SSGNAKIGHPAPNFKATAVMPDGQFKDISLSDYKGKYVVFFFYPLDFTFVCPTEIIAFSDRAEEFKKLNCQVIGASVDSHFCHLAWVNTPKKQGGLGPMNIPLVSDPKRTIAQDYGVLKADEGISFRGLFIIDDKGILRQITVNDLPVGRSVDETLRLVQAFQFTDKHGEVCPAGWKPGSDTIKPDVQKSKEYFSKQK,22007.24851969,22021.20318,,RESID:51@0,,,1
1049,PRDX1_HUMAN,Q06830,Peroxiredoxin-1,Q06830,,MSSGNAKIGHPAPNFKATAVMPDGQFKDISLSDYKGKYVVFFFYPLDFTFVCPTEIIAFSDRAEEFKKLNCQVIGASVDSHFCHLAWVNTPKKQGGLGPMNIPLVSDPKRTIAQDYGVLKADEGISFRGLFIIDDKGILRQITVNDLPVGRSVDETLRLVQAFQFTDKHGEVCPAGWKPGSDTIKPDVQKSKEYFSKQK,1,198,198,SSGNAKIGHPAPNFKATAVMPDGQFKDISLSDYKGKYVVFFFYPLDFTFVCPTEIIAFSDRAEEFKKLNCQVIGASVDSHFCHLAWVNTPKKQGGLGPMNIPLVSDPKRTIAQDYGVLKADEGISFRGLFIIDDKGILRQITVNDLPVGRSVDETLRLVQAFQFTDKHGEVCPAGWKPGSDTIKPDVQKSKEYFSKQK,22087.21485069,22101.18318,,RESID:51@0|RESID:38@88,,,1
1051,SRP09_HUMAN,P49458,Signal recognition particle 9 kDa protein,P49458-1,1,MPQYQTWEEFSRAAEKLYLADPMKARVVLKYRHSDGNLCVKVTDDLVCLVYKTDQAQDVKKIEKFHSQLMRLMVAKEARNVTMETE,1,85,85,PQYQTWEEFSRAAEKLYLADPMKARVVLKYRHSDGNLCVKVTDDLVCLVYKTDQAQDVKKIEKFHSQLMRLMVAKEARNVTMETE,9974.07036468999,9980.54648,,,,,1
1052,ROA1_HUMAN,P09651,Heterogeneous nuclear ribonucleoprotein A1,P09651-2,A1-A,MSKSESPKEPEQLRKLFIGGLSFETTDESLRSHFEQWGTLTDCVVMRDPNTKRSRGFGFVTYATVEEVDAAMNARPHKVDGRVVEPKRAVSREDSQRPGAHLTVKKIFVGGIKEDTEEHHLRDYFEQYGKIEVIEIMTDRGSGKKRGFAFVTFDDHDSVDKIVIQKYHTVNGHNCEVRKALSKQEMASASSSQRGRSGSGNFGGGRGGGFGGNDNFGRGGNFSGRGGFGGSRGGGGYGGSGDGYNGFGNDGSNFGGGGSYNDFGNYNNQSSNFGPMKGGNFGGRSSGPYGGGGQYFAKPRNQGGYGGSSSSSSYGSGRRF,1,319,319,SKSESPKEPEQLRKLFIGGLSFETTDESLRSHFEQWGTLTDCVVMRDPNTKRSRGFGFVTYATVEEVDAAMNARPHKVDGRVVEPKRAVSREDSQRPGAHLTVKKIFVGGIKEDTEEHHLRDYFEQYGKIEVIEIMTDRGSGKKRGFAFVTFDDHDSVDKIVIQKYHTVNGHNCEVRKALSKQEMASASSSQRGRSGSGNFGGGRGGGFGGNDNFGRGGNFSGRGGFGGSRGGGGYGGSGDGYNGFGNDGSNFGGGGSYNDFGNYNNQSSNFGPMKGGNFGGRSSGPYGGGGQYFAKPRNQGGYGGSSSSSSYGSGRRF,34086.22364969,34107.0446799999,,RESID:51@0,,,1
1054,ACBP_HUMAN,P07108,Acyl-CoA-binding protein,P07108-1,1,MSQAEFEKAAEEVRHLKTKPSDEEMLFIYGHYKQATVGDINTERPGMLDFTGKAKWDAWNELKGTSKEDAMKAYINKVEELKKKYGI,1,86,86,SQAEFEKAAEEVRHLKTKPSDEEMLFIYGHYKQATVGDINTERPGMLDFTGKAKWDAWNELKGTSKEDAMKAYINKVEELKKKYGI,9948.99084969,9955.26778,,RESID:51@0,,,1
1056,REEP5_HUMAN,Q00765,Receptor expression-enhancing protein 5,Q00765-1,1,MSAAMRERFDRFLHEKNCMTDLLAKLEAKTGVNRSFIALGVIGLVALYLVFGYGASLLCNLIGFGYPAYISIKAIESPNKEDDTQWLTYWVVYGVFSIAEFFSDIFLSWFPFYYMLKCGFLLWCMAPSPSNGAELLYKRIIRPFFLKHESQMDSVVKDLKDKAKETADAITKEAKKATVNLLGEEKKST,1,188,188,SAAMRERFDRFLHEKNCMTDLLAKLEAKTGVNRSFIALGVIGLVALYLVFGYGASLLCNLIGFGYPAYISIKAIESPNKEDDTQWLTYWVVYGVFSIAEFFSDIFLSWFPFYYMLKCGFLLWCMAPSPSNGAELLYKRIIRPFFLKHESQMDSVVKDLKDKAKETADAITKEAKKATVNLLGEEKKST,21390.01176969,21403.97148,,RESID:51@0,,,1
1059,K1C18_HUMAN,P05783,Keratin; type I cytoskeletal 18,P05783,,MSFTTRSTFSTNYRSLGSVQAPSYGARPVSSAASVYAGAGGSGSRISVSRSTSFRGGMGSGGLATGIAGGLAGMGGIQNEKETMQSLNDRLASYLDRVRSLETENRRLESKIREHLEKKGPQVRDWSHYFKIIEDLRAQIFANTVDNARIVLQIDNARLAADDFRVKYETELAMRQSVENDIHGLRKVIDDTNITRLQLETEIEALKEELLFMKKNHEEEVKGLQAQIASSGLTVEVDAPKSQDLAKIMADIRAQYDELARKNREELDKYWSQQIEESTTVVTTQSAEVGAAETTLTELRRTVQSLEIDLDSMRNLKASLENSLREVEARYALQMEQLNGILLHLESELAQTRAEGQRQAQEYEALLNIKVKLEAEIATYRRLLEDGEDFNLGDALDSSNSMQTIQKTTTRRIVDGKVVSETNDTKVLRH,1,429,429,SFTTRSTFSTNYRSLGSVQAPSYGARPVSSAASVYAGAGGSGSRISVSRSTSFRGGMGSGGLATGIAGGLAGMGGIQNEKETMQSLNDRLASYLDRVRSLETENRRLESKIREHLEKKGPQVRDWSHYFKIIEDLRAQIFANTVDNARIVLQIDNARLAADDFRVKYETELAMRQSVENDIHGLRKVIDDTNITRLQLETEIEALKEELLFMKKNHEEEVKGLQAQIASSGLTVEVDAPKSQDLAKIMADIRAQYDELARKNREELDKYWSQQIEESTTVVTTQSAEVGAAETTLTELRRTVQSLEIDLDSMRNLKASLENSLREVEARYALQMEQLNGILLHLESELAQTRAEGQRQAQEYEALLNIKVKLEAEIATYRRLLEDGEDFNLGDALDSSNSMQTIQKTTTRRIVDGKVVSETNDTKVLRH,47939.5051996901,47968.65768,,RESID:51@0,,,1
1060,DHSD_HUMAN,O14521,Succinate dehydrogenase [ubiquinone] cytochrome b small subunit; mitochondrial,O14521-1,1,MAVLWRLSAVCGALGGRALLLRTPVVRPAHISAFLQDRPIPEWCGVQHIHLSPSHHSGSKAASLHWTSERVVSVLLLGLLPAAYLNPCSAMDYSLAAALTLHGHWGLGQVVTDYVHGDALQKAAKAGLLALSALTFAGLCYFNYHDVGICKAVAMLWKL,56,158,103,SGSKAASLHWTSERVVSVLLLGLLPAAYLNPCSAMDYSLAAALTLHGHWGLGQVVTDYVHGDALQKAAKAGLLALSALTFAGLCYFNYHDVGICKAVAMLWKL,10881.63931469,10888.72698,,,,,1
1063,LSM3_HUMAN,P62310,U6 snRNA-associated Sm-like protein LSm3,P62310,,MADDVDQQQTTNTVEEPLDLIRLSLDERIYVKMRNDRELRGRLHAYDQHLNMILGDVEETVTTIEIDEETYEEIYKSTKRNIPMLFVRGDGVVLVAPPLRVG,1,101,101,ADDVDQQQTTNTVEEPLDLIRLSLDERIYVKMRNDRELRGRLHAYDQHLNMILGDVEETVTTIEIDEETYEEIYKSTKRNIPMLFVRGDGVVLVAPPLRVG,11748.99329969,11756.25528,,RESID:41@0,,,1
1064,CX6A1_HUMAN,P12074,Cytochrome c oxidase subunit 6A1; mitochondrial,P12074,,MAVVGVSSVSRLLGRSRPQLGRPMSSGAHGEEGSARMWKTLTFFVALPGVAVSMLNVYLKSHHGEHERPEFIAYPHLRIRTKPFPWGDGNHTLFHNPHVNPLPTGYEDE,24,108,85,SSGAHGEEGSARMWKTLTFFVALPGVAVSMLNVYLKSHHGEHERPEFIAYPHLRIRTKPFPWGDGNHTLFHNPHVNPLPTGYEDE,9612.74298468999,9618.79678,,,,,1
1065,ENOA_HUMAN,P06733,Alpha-enolase,P06733-1,alpha-enolase,MSILKIHAREIFDSRGNPTVEVDLFTSKGLFRAAVPSGASTGIYEALELRDNDKTRYMGKGVSKAVEHINKTIAPALVSKKLNVTEQEKIDKLMIEMDGTENKSKFGANAILGVSLAVCKAGAVEKGVPLYRHIADLAGNSEVILPVPAFNVINGGSHAGNKLAMQEFMILPVGAANFREAMRIGAEVYHNLKNVIKEKYGKDATNVGDEGGFAPNILENKEGLELLKTAIGKAGYTDKVVIGMDVAASEFFRSGKYDLDFKSPDDPSRYISPDQLADLYKSFIKDYPVVSIEDPFDQDDWGAWQKFTASAGIQVVGDDLTVTNPKRIAKAVNEKSCNCLLLKVNQIGSVTESLQACKLAQANGWGVMVSHRSGETEDTFIADLVVGLCTGQIKTGAPCRSERLAKYNQLLRIEEELGSKAKFAGRNFRNPLAK,1,433,433,SILKIHAREIFDSRGNPTVEVDLFTSKGLFRAAVPSGASTGIYEALELRDNDKTRYMGKGVSKAVEHINKTIAPALVSKKLNVTEQEKIDKLMIEMDGTENKSKFGANAILGVSLAVCKAGAVEKGVPLYRHIADLAGNSEVILPVPAFNVINGGSHAGNKLAMQEFMILPVGAANFREAMRIGAEVYHNLKNVIKEKYGKDATNVGDEGGFAPNILENKEGLELLKTAIGKAGYTDKVVIGMDVAASEFFRSGKYDLDFKSPDDPSRYISPDQLADLYKSFIKDYPVVSIEDPFDQDDWGAWQKFTASAGIQVVGDDLTVTNPKRIAKAVNEKSCNCLLLKVNQIGSVTESLQACKLAQANGWGVMVSHRSGETEDTFIADLVVGLCTGQIKTGAPCRSERLAKYNQLLRIEEELGSKAKFAGRNFRNPLAK,47050.2884796901,47079.8093799999,,RESID:51@0,,,1
1067,K2C8_HUMAN,P05787,Keratin; type II cytoskeletal 8,P05787-1,1,MSIRVTQKSYKVSTSGPRAFSSRSYTSGPGSRISSSSFSRVGSSNFRGGLGGGYGGASGMGGITAVTVNQSLLSPLVLEVDPNIQAVRTQEKEQIKTLNNKFASFIDKVRFLEQQNKMLETKWSLLQQQKTARSNMDNMFESYINNLRRQLETLGQEKLKLEAELGNMQGLVEDFKNKYEDEINKRTEMENEFVLIKKDVDEAYMNKVELESRLEGLTDEINFLRQLYEEEIRELQSQISDTSVVLSMDNSRSLDMDSIIAEVKAQYEDIANRSRAEAESMYQIKYEELQSLAGKHGDDLRRTKTEISEMNRNISRLQAEIEGLKGQRASLEAAIADAEQRGELAIKDANAKLSELEAALQRAKQDMARQLREYQELMNVKLALDIEIATYRKLLEGEESRLESGMQNMSIHTKTTSGYAGGLSSAYGGLTSPGLSYSLGSSFGSGAGSSSFSRTSSSRAVVVKKIETRDGKLVSESSDVLPK,1,482,482,SIRVTQKSYKVSTSGPRAFSSRSYTSGPGSRISSSSFSRVGSSNFRGGLGGGYGGASGMGGITAVTVNQSLLSPLVLEVDPNIQAVRTQEKEQIKTLNNKFASFIDKVRFLEQQNKMLETKWSLLQQQKTARSNMDNMFESYINNLRRQLETLGQEKLKLEAELGNMQGLVEDFKNKYEDEINKRTEMENEFVLIKKDVDEAYMNKVELESRLEGLTDEINFLRQLYEEEIRELQSQISDTSVVLSMDNSRSLDMDSIIAEVKAQYEDIANRSRAEAESMYQIKYEELQSLAGKHGDDLRRTKTEISEMNRNISRLQAEIEGLKGQRASLEAAIADAEQRGELAIKDANAKLSELEAALQRAKQDMARQLREYQELMNVKLALDIEIATYRKLLEGEESRLESGMQNMSIHTKTTSGYAGGLSSAYGGLTSPGLSYSLGSSFGSGAGSSSFSRTSSSRAVVVKKIETRDGKLVSESSDVLPK,53582.1023896902,53615.09248,,RESID:51@0,,,1
1068,COX7B_HUMAN,P24311,Cytochrome c oxidase subunit 7B; mitochondrial,P24311,,MFPLVKSALNRLQVRSIQQTMARQSHQKRTPDFHDKYGNAVLASGATFCIVTWTYVATQVGIEWNLSPVGRVTPKEWRNQ,24,79,56,SHQKRTPDFHDKYGNAVLASGATFCIVTWTYVATQVGIEWNLSPVGRVTPKEWRNQ,6358.19221469,6362.14888,,,,,1
1069,H2A2A_HUMAN,Q6FI13,Histone H2A type 2-A,Q6FI13,,MSGRGKQGGKARAKAKSRSSRAGLQFPVGRVHRLLRKGNYAERVGAGAPVYMAAVLEYLTAEILELAGNAARDNKKTRIIPRHLQLAIRNDEELNKLLGKVTIAQGGVLPNIQAVLLPKKTESHHKAKGK,1,129,129,SGRGKQGGKARAKAKSRSSRAGLQFPVGRVHRLLRKGNYAERVGAGAPVYMAAVLEYLTAEILELAGNAARDNKKTRIIPRHLQLAIRNDEELNKLLGKVTIAQGGVLPNIQAVLLPKKTESHHKAKGK,13997.85942969,14006.33558,,RESID:51@0,,,1
1070,RLA2_HUMAN,P05387,60S acidic ribosomal protein P2,P05387,,MRYVASYLLAALGGNSSPSAKDIKKILDSVGIEADDDRLNKVISELNGKNIEDVIAQGIGKLASVPAGGAVAVSAAPGSAAPAAGSAPAAAEEKKDEKKEESEESDDDMGFGLFD,0,114,115,MRYVASYLLAALGGNSSPSAKDIKKILDSVGIEADDDRLNKVISELNGKNIEDVIAQGIGKLASVPAGGAVAVSAAPGSAAPAAGSAPAAAEEKKDEKKEESEESDDDMGFGLFD,11817.77969669,11824.89708,,RESID:37@85|RESID:37@101,,,1
1073,RUXG_HUMAN,P62308,Small nuclear ribonucleoprotein G,P62308,,MSKAHPPELKKFMDKKLSLKLNGGRHVQGILRGFDPFMNLVIDECVEMATSGQQNNIGMVVIRGNSIIMLEALERV,1,75,75,SKAHPPELKKFMDKKLSLKLNGGRHVQGILRGFDPFMNLVIDECVEMATSGQQNNIGMVVIRGNSIIMLEALERV,8401.39710969,8406.91298,,RESID:51@0,,,1