PFR,UniProt Id,Entry Accession,Entry Description,Isoform Accession,Isoform Description,Isoform Sequence,Start,End,Length,Proteoform Sequence,Monoisotopic Mass,Average Mass,Sequence Modifications,PTMs,N-Terminal,C-Terminal,Star
1011,NEDD8_HUMAN,Q15843,NEDD8,Q15843,,MLIKVKTLTGKEIEIDIEPTDKVERIKERVEEKEGIPPQQQRLIYSGKQMNDEKTAADYKILGGSVLHLVLALRGGGGLRQ,0,75,76,MLIKVKTLTGKEIEIDIEPTDKVERIKERVEEKEGIPPQQQRLIYSGKQMNDEKTAADYKILGGSVLHLVLALRGG,8554.66613469,8559.97098,,,,,1
1046,RL38_HUMAN,P63173,60S ribosomal protein L38,P63173,,MPRKIEEIKDFLLTARRKDAKSVKIKKNKDNVKFKVRCSRYLYTLVITDKEKAEKLKQSLPPGLAVKELK,1,69,69,PRKIEEIKDFLLTARRKDAKSVKIKKNKDNVKFKVRCSRYLYTLVITDKEKAEKLKQSLPPGLAVKELK,8081.69137469,8086.69548,,,,,3
1101,ATP5E_HUMAN,P56381,ATP synthase subunit epsilon; mitochondrial,P56381,,MVAYWRQAGLSYIRYSQICAKAVRDALKTEFKANAEKTSGSNVKIVKVKKE,1,50,50,VAYWRQAGLSYIRYSQICAKAVRDALKTEFKANAEKTSGSNVKIVKVKKE,5645.06672469,5648.56968,,,,,1
1121,S10AB_HUMAN,P31949,Protein S100-A11,P31949,,MAKISSPTETERCIESLIAVFQKYAGKDGYNYTLSKTEFLSFMNTELAAFTKNQKDPGVLDRMMKKLDTNSDGQLDFSEFLNLIGGLAMACHDSFLKAVPSQKRT,0,104,105,MAKISSPTETERCIESLIAVFQKYAGKDGYNYTLSKTEFLSFMNTELAAFTKNQKDPGVLDRMMKKLDTNSDGQLDFSEFLNLIGGLAMACHDSFLKAVPSQKRT,11732.82494469,11740.44498,,,,,1
2128,RS17_HUMAN,P08708,40S ribosomal protein S17,P08708,,MGRVRTKTVKKAARVIIEKYYTRLGNDFHTNKRVCEEIAIIPSKKLRNKIAGYVTHLMKRIQRGPVRGISIKLQEEERERRDNYVPEVSALDQEIIEVDPDTKEMLKLLDFGSLSNLQVTQPTVGMNFKTPRGPV,0,134,135,MGRVRTKTVKKAARVIIEKYYTRLGNDFHTNKRVCEEIAIIPSKKLRNKIAGYVTHLMKRIQRGPVRGISIKLQEEERERRDNYVPEVSALDQEIIEVDPDTKEMLKLLDFGSLSNLQVTQPTVGMNFKTPRGPV,15540.38960469,15550.12128,,,,,1
2243,H2B1C_HUMAN,P62807,Histone H2B type 1-C/E/F/G/I,P62807,,MPEPAKSAPAPKKGSKKAVTKAQKKDGKKRKRSRKESYSVYVYKVLKQVHPDTGISSKAMGIMNSFVNDIFERIAGEASRLAHYNKRSTITSREIQTAVRLLLPGELAKHAVSEGTKAVTKYTSSK,0,125,126,MPEPAKSAPAPKKGSKKAVTKAQKKDGKKRKRSRKESYSVYVYKVLKQVHPDTGISSKAMGIMNSFVNDIFERIAGEASRLAHYNKRSTITSREIQTAVRLLLPGELAKHAVSEGTKAVTKYTSSK,13897.55727469,13906.13908,,,,,1
2719,S10AA_HUMAN,P60903,Protein S100-A10,P60903,,MPSQMEHAMETMMFTFHKFAGDKGYLTKEDLRVLMEKEFPGFLENQKDPLAVDKIMKDLDQCRDGKVGFQSFFSLIAGLTIACNDYFVVHMKQKGKK,0,96,97,MPSQMEHAMETMMFTFHKFAGDKGYLTKEDLRVLMEKEFPGFLENQKDPLAVDKIMKDLDQCRDGKVGFQSFFSLIAGLTIACNDYFVVHMKQKGKK,11195.51107469,11203.10428,,,,,1
3400,H2A2A_HUMAN,Q6FI13,Histone H2A type 2-A,Q6FI13,,MSGRGKQGGKARAKAKSRSSRAGLQFPVGRVHRLLRKGNYAERVGAGAPVYMAAVLEYLTAEILELAGNAARDNKKTRIIPRHLQLAIRNDEELNKLLGKVTIAQGGVLPNIQAVLLPKKTESHHKAKGK,0,129,130,MSGRGKQGGKARAKAKSRSSRAGLQFPVGRVHRLLRKGNYAERVGAGAPVYMAAVLEYLTAEILELAGNAARDNKKTRIIPRHLQLAIRNDEELNKLLGKVTIAQGGVLPNIQAVLLPKKTESHHKAKGK,14086.88935469,14095.48818,,,,,1
3734,ERH_HUMAN,P84090,Enhancer of rudimentary homolog,P84090,,MSHTILLVQPTKRPEGRTYADYESVNECMEGVCKMYEEHLKRMNPNSPSITYDISQLFDFIDDLADLSCLVYRADTQTYQPYNKDWIKEKIYVLLRRQAQQAGK,0,103,104,MSHTILLVQPTKRPEGRTYADYESVNECMEGVCKMYEEHLKRMNPNSPSITYDISQLFDFIDDLADLSCLVYRADTQTYQPYNKDWIKEKIYVLLRRQAQQAGK,12251.00243469,12258.93678,,,,,1
3766,TBCA_HUMAN,O75347,Tubulin-specific chaperone A,O75347-1,1,MADPRVRQIKIKTGVVKRLVKEKVMYEKEAKQQEEKIEKMRAEDGENYDIKKQAEILQESRMMIPDCQRRLEAAYLDLQRILENEKDLEEAEEYKEARLVLDSVKLEA,0,107,108,MADPRVRQIKIKTGVVKRLVKEKVMYEKEAKQQEEKIEKMRAEDGENYDIKKQAEILQESRMMIPDCQRRLEAAYLDLQRILENEKDLEEAEEYKEARLVLDSVKLEA,12846.71072469,12854.82908,,,,,1
3773,RL24_HUMAN,P83731,60S ribosomal protein L24,P83731,,MKVELCSFSGYKIYPGHGRRYARTDGKVFQFLNAKCESAFLSKRNPRQINWTVLYRRKHKKGQSEEIQKKRTRRAVKFQRAITGASLADIMAKRNQKPEVRKAQREQAIRAAKEAKKAKQASKKTAMAAAKAPTKAAPKQKIVKPVKVSAPRVGGKR,0,156,157,MKVELCSFSGYKIYPGHGRRYARTDGKVFQFLNAKCESAFLSKRNPRQINWTVLYRRKHKKGQSEEIQKKRTRRAVKFQRAITGASLADIMAKRNQKPEVRKAQREQAIRAAKEAKKAKQASKKTAMAAAKAPTKAAPKQKIVKPVKVSAPRVGGKR,17767.89649469,17778.95608,,,,,1
3857,RUXE_HUMAN,P62304,Small nuclear ribonucleoprotein E,P62304,,MAYRGQGQKVQKVMVQPINLIFRYLQNRSRIQVWLYEQVNMRIEGCIIGFDEYMNLVLDDAEEIHSKTKSRKQLGRIMLKGDNITLLQSVSN,0,91,92,MAYRGQGQKVQKVMVQPINLIFRYLQNRSRIQVWLYEQVNMRIEGCIIGFDEYMNLVLDDAEEIHSKTKSRKQLGRIMLKGDNITLLQSVSN,10796.63680469,10803.60098,,,,,1
3955,S10A4_HUMAN,P26447,Protein S100-A4,P26447,,MACPLEKALDVMVSTFHKYSGKEGDKFKLNKSELKELLTRELPSFLGKRTDEAAFQKLMSNLDSNRDNEVDFQEYCVFLSCIAMMCNEFFEGFPDKQPRKK,0,100,101,MACPLEKALDVMVSTFHKYSGKEGDKFKLNKSELKELLTRELPSFLGKRTDEAAFQKLMSNLDSNRDNEVDFQEYCVFLSCIAMMCNEFFEGFPDKQPRKK,11720.73190469,11728.51578,,,,,1
4651,S10A6_HUMAN,P06703,Protein S100-A6,P06703,,MACPLDQAIGLLVAIFHKYSGREGDKHTLSKKELKELIQKELTIGSKLQDAEIARLMEDLDRNKDQEVNFQEYVTFLGALALIYNEALKG,1,89,89,ACPLDQAIGLLVAIFHKYSGREGDKHTLSKKELKELIQKELTIGSKLQDAEIARLMEDLDRNKDQEVNFQEYVTFLGALALIYNEALKG,10042.30185469,10048.54628,,,,,1
8484,RL39_HUMAN,P62891,60S ribosomal protein L39,P62891,,MSSHKTFRIKRFLAKKQKQNRPIPQWIRMKTGNKIRYNSKRRHWRRTKLGL,0,50,51,MSSHKTFRIKRFLAKKQKQNRPIPQWIRMKTGNKIRYNSKRRHWRRTKLGL,6402.65039469,6406.67788,,,,,1
11808,CH10_HUMAN,P61604,10 kDa heat shock protein; mitochondrial,P61604,,MAGQAFRKFLPLFDRVLVERSAAETVTKGGIMLPEKSQGKVLQATVVAVGSGSKGKGGEIQPVSVKVGDKVLLPEYGGTKVVLDDKDYFLFRDGDILGKYVD,0,101,102,MAGQAFRKFLPLFDRVLVERSAAETVTKGGIMLPEKSQGKVLQATVVAVGSGSKGKGGEIQPVSVKVGDKVLLPEYGGTKVVLDDKDYFLFRDGDILGKYVD,10924.87090469,10931.69188,,,,,1
11824,NDUA4_HUMAN,O00483,Cytochrome c oxidase subunit NDUFA4,O00483,,MLRQIIGQAKKHPSLIPLFVFIGTGATGATLYLLRLALFNPDVCWDRNNPEPWNKLGPNDQYKFYSVNVDYSKLKKERPDF,1,80,80,LRQIIGQAKKHPSLIPLFVFIGTGATGATLYLLRLALFNPDVCWDRNNPEPWNKLGPNDQYKFYSVNVDYSKLKKERPDF,9232.86968468999,9238.66968,,,,,0
11825,QCR10_HUMAN,O14957,Cytochrome b-c1 complex subunit 10,O14957,,MVTRFLGPRYRELVKNWVPTAYTWGAVGAVGLVWATDWRLILDWVPYINGKFKKDN,1,55,55,VTRFLGPRYRELVKNWVPTAYTWGAVGAVGLVWATDWRLILDWVPYINGKFKKDN,6434.44243469,6438.49078,,,,,1
11826,BAF_HUMAN,O75531,Barrier-to-autointegration factor,O75531,,MTTSQKHRDFVAEPMGEKPVGSLAGIGEVLGKKLEERGFDKAYVVLGQFLVLKKDEDLFREWLKDTCGANAKQSRDCFGCLREWCDAFL,1,88,88,TTSQKHRDFVAEPMGEKPVGSLAGIGEVLGKKLEERGFDKAYVVLGQFLVLKKDEDLFREWLKDTCGANAKQSRDCFGCLREWCDAFL,10042.95976069,10049.40288,,PSI-MOD:394@0|PSI-MOD:1455@2,,,0
11827,BAF_HUMAN,O75531,Barrier-to-autointegration factor,O75531,,MTTSQKHRDFVAEPMGEKPVGSLAGIGEVLGKKLEERGFDKAYVVLGQFLVLKKDEDLFREWLKDTCGANAKQSRDCFGCLREWCDAFL,1,88,88,TTSQKHRDFVAEPMGEKPVGSLAGIGEVLGKKLEERGFDKAYVVLGQFLVLKKDEDLFREWLKDTCGANAKQSRDCFGCLREWCDAFL,9962.99342969,9969.42288,,PSI-MOD:394@0,,,0
11828,ATP5L_HUMAN,O75964,ATP synthase subunit g; mitochondrial,O75964,,MAQFVRNLVEKTPALVNAAVTYSKPRLATFWYYAKVELVPPTPAEIPRAIQSLKKIVNSAQTGSFKQLTVKEAVLNGLVATEVLMWFYVGEIIGKRGIIGYDV,0,102,103,MAQFVRNLVEKTPALVNAAVTYSKPRLATFWYYAKVELVPPTPAEIPRAIQSLKKIVNSAQTGSFKQLTVKEAVLNGLVATEVLMWFYVGEIIGKRGIIGYDV,11421.24279469,11428.47678,,,,,1
11829,NDUA3_HUMAN,O95167,NADH dehydrogenase [ubiquinone] 1 alpha subcomplex subunit 3,O95167,,MAARVGAFLKNAWDKEPVLVVSFVVGGLAVILPPLSPYFKYSVMINKATPYNYPVPVRDDGNMPDVPSHPQDPQGPSLEWLKKL,1,83,83,AARVGAFLKNAWDKEPVLVVSFVVGGLAVILPPLSPYFKYSVMINKATPYNYPVPVRDDGNMPDVPSHPQDPQGPSLEWLKKL,9183.82294968999,9189.69338,,PSI-MOD:394@0,,,0
11830,PTMA_HUMAN,P06454,Prothymosin alpha,P06454-1,1,MSDAAVDTSSEITTKDLKEKKEVVEEAENGRDAPANGNAENEENGEQEADNEVDEEEEEGGEEEEEEEEGDGEEEDGDEDEEAESATGKRAAEDDEDDDVDTKKQKTDEDD,1,110,110,SDAAVDTSSEITTKDLKEKKEVVEEAENGRDAPANGNAENEENGEQEADNEVDEEEEEGGEEEEEEEEGDGEEEDGDEDEEAESATGKRAAEDDEDDDVDTKKQKTDEDD,12106.93875969,12113.80898,,PSI-MOD:394@0,,,0
11831,PTMA_HUMAN,P06454,Prothymosin alpha,P06454-1,1,MSDAAVDTSSEITTKDLKEKKEVVEEAENGRDAPANGNAENEENGEQEADNEVDEEEEEGGEEEEEEEEGDGEEEDGDEDEEAESATGKRAAEDDEDDDVDTKKQKTDEDD,0,110,111,MSDAAVDTSSEITTKDLKEKKEVVEEAENGRDAPANGNAENEENGEQEADNEVDEEEEEGGEEEEEEEEGDGEEEDGDEDEEAESATGKRAAEDDEDDDVDTKKQKTDEDD,12195.96868469,12202.96158,,,,,1
11832,UBB_HUMAN,P0CG47,Polyubiquitin-B,P0CG47,,MQIFVKTLTGKTITLEVEPSDTIENVKAKIQDKEGIPPDQQRLIFAGKQLEDGRTLSDYNIQKESTLHLVLRLRGGMQIFVKTLTGKTITLEVEPSDTIENVKAKIQDKEGIPPDQQRLIFAGKQLEDGRTLSDYNIQKESTLHLVLRLRGGMQIFVKTLTGKTITLEVEPSDTIENVKAKIQDKEGIPPDQQRLIFAGKQLEDGRTLSDYNIQKESTLHLVLRLRGGC,0,149,150,MQIFVKTLTGKTITLEVEPSDTIENVKAKIQDKEGIPPDQQRLIFAGKQLEDGRTLSDYNIQKESTLHLVLRLRGGMQIFVKTLTGKTITLEVEPSDTIENVKAKIQDKEGIPPDQQRLIFAGKQLEDGRTLSDYNIQKESTLHLVLRLR,16987.17964469,16997.57068,,,,,0
11833,H14_HUMAN,P10412,Histone H1.4,P10412,,MSETAPAAPAAPAPAEKTPVKKKARKSAGAAKRKASGPPVSELITKAVAASKERSGVSLAALKKALAAAGYDVEKNNSRIKLGLKSLVSKGTLVQTKGTGASGSFKLNKKAASGEAKPKAKKAGAAKAKKPAGAAKKPKKATGAATPKKSAKKTPKKAKKPAAAAGAKKAKSPKKAKAAKPKKAPKSPAKAKAVKPKAAKPKTAKPKAAKPKKAAAKKK,1,218,218,SETAPAAPAAPAPAEKTPVKKKARKSAGAAKRKASGPPVSELITKAVAASKERSGVSLAALKKALAAAGYDVEKNNSRIKLGLKSLVSKGTLVQTKGTGASGSFKLNKKAASGEAKPKAKKAGAAKAKKPAGAAKKPKKATGAATPKKSAKKTPKKAKKPAAAAGAKKAKSPKKAKAAKPKKAPKSPAKAKAVKPKAAKPKTAKPKAAKPKKAAAKKK,21762.97378969,21776.11868,,PSI-MOD:394@0,,,0
11834,MIF_HUMAN,P14174,Macrophage migration inhibitory factor,P14174,,MPMFIVNTNVPRASVPDGFLSELTQQLAQATGKPPQYIAVHVVPDQLMAFGGSSEPCALCSLHSIGKIGGAQNRSYSKLLCGLLAERLRISPDRVYINYYDMNAANVGWNNSTFA,0,114,115,MPMFIVNTNVPRASVPDGFLSELTQQLAQATGKPPQYIAVHVVPDQLMAFGGSSEPCALCSLHSIGKIGGAQNRSYSKLLCGLLAERLRISPDRVYINYYDMNAANVGWNNSTFA,12468.21914469,12476.29968,,,,,0
11835,COX7C_HUMAN,P15954,Cytochrome c oxidase subunit 7C; mitochondrial,P15954,,MLGQSIRRFTTSVVRRSHYEEGPGKNLPFSVENKWSLLAKMCLYFGSAFATPFLVVRHQLLKT,16,62,47,SHYEEGPGKNLPFSVENKWSLLAKMCLYFGSAFATPFLVVRHQLLKT,5352.76195469,5356.24798,,,,,1
11836,RL7_HUMAN,P18124,60S ribosomal protein L7,P18124,,MEGVEEKKKEVPAVPETLKKKRRNFAELKIKRLRKKFAQKMLRKARRKLIYEKAKHYHKEYRQMYRTEIRMARMARKAGNFYVPAEPKLAFVIRIRGINGVSPKVRKVLQLLRLRQIFNGTFVKLNKASINMLRIVEPYIAWGYPNLKSVNELIYKRGYGKINKKRIALTDNALIARSLGKYGIICMEDLIHEIYTVGKRFKEANNFLWPFKLSSPRGGMKKKTTHFVEGGDAGNREDQINRLIRRMN,0,247,248,MEGVEEKKKEVPAVPETLKKKRRNFAELKIKRLRKKFAQKMLRKARRKLIYEKAKHYHKEYRQMYRTEIRMARMARKAGNFYVPAEPKLAFVIRIRGINGVSPKVRKVLQLLRLRQIFNGTFVKLNKASINMLRIVEPYIAWGYPNLKSVNELIYKRGYGKINKKRIALTDNALIARSLGKYGIICMEDLIHEIYTVGKRFKEANNFLWPFKLSSPRGGMKKKTTHFVEGGDAGNREDQINRLIRRMN,29207.19720469,29225.77498,,,,,0
11837,RL17_HUMAN,P18621,60S ribosomal protein L17,P18621-1,1,MVRYSLDPENPTKSCKSRGSNLRVHFKNTRETAQAIKGMHIRKATKYLKDVTLQKQCVPFRRYNGGVGRCAQAKQWGWTQGRWPKKSAEFLLHMLKNAESNAELKGLDVDSLVIEHIQVNKAPKMRRRTYRAHGRINPYMSSPCHIEMILTEKEQIVPKPEEEVAQKKKISQKKLKKQKLMARE,0,183,184,MVRYSLDPENPTKSCKSRGSNLRVHFKNTRETAQAIKGMHIRKATKYLKDVTLQKQCVPFRRYNGGVGRCAQAKQWGWTQGRWPKKSAEFLLHMLKNAESNAELKGLDVDSLVIEHIQVNKAPKMRRRTYRAHGRINPYMSSPCHIEMILTEKEQIVPKPEEEVAQKKKISQKKLKKQKLMARE,21383.33238469,21397.02228,,,,,0
11838,RS12_HUMAN,P25398,40S ribosomal protein S12,P25398,,MAEEGIAAGGVMDVNTALQEVLKTALIHDGLARGIREAAKALDKRQAHLCVLASNCDEPMYVKLVEALCAEHQINLIKVDDNKKLGEWVGLCKIDREGKPRKVVGCSCVVVKDYGKESQAKDVIEEYFKCKK,1,131,131,AEEGIAAGGVMDVNTALQEVLKTALIHDGLARGIREAAKALDKRQAHLCVLASNCDEPMYVKLVEALCAEHQINLIKVDDNKKLGEWVGLCKIDREGKPRKVVGCSCVVVKDYGKESQAKDVIEEYFKCKK,14416.45135969,14425.78308,,PSI-MOD:394@0,,,0
11839,S100P_HUMAN,P25815,Protein S100-P,P25815,,MTELETAMGMIIDVFSRYSGSEGSTQTLTKGELKVLMEKELPGFLQSGKDKDAVDKLLKDLDANGDAQVDFSEFIVFVAAITSACHKYFEKAGLK,0,94,95,MTELETAMGMIIDVFSRYSGSEGSTQTLTKGELKVLMEKELPGFLQSGKDKDAVDKLLKDLDANGDAQVDFSEFIVFVAAITSACHKYFEKAGLK,10393.22227469,10399.90188,,,,,0
11840,SRP14_HUMAN,P37108,Signal recognition particle 14 kDa protein,P37108,,MVLLESEQFLTELTRLFQKCRTSGSVYITLKKYDGRTKPIPKKGTVEGFEPADNKCLLRATDGKKKISTVVSSKEVNKFQMAYSNLLRANMDGLKKRDKKNKTKKTKAAAAAAAAAPAAAATAPTTAATTAATAAQ,0,135,136,MVLLESEQFLTELTRLFQKCRTSGSVYITLKKYDGRTKPIPKKGTVEGFEPADNKCLLRATDGKKKISTVVSSKEVNKFQMAYSNLLRANMDGLKKRDKKNKTKKTKAAAAAAAAAPAAAATAPTTAATTAATAAQ,14560.81670469,14569.93218,,,,,0
11841,RS19_HUMAN,P39019,40S ribosomal protein S19,P39019,,MPGVTVKDVNQQEFVRALAAFLKKSGKLKVPEWVDTVKLAKHKELAPYDENWFYTRAASTARHLYLRGGAGVGSMTKIYGGRQRNGVMPSHFSRGSKSVARRVLQALEGLKMVEKDQDGGRKLTPQGQRDLDRIAGQVAAANKKH,0,144,145,MPGVTVKDVNQQEFVRALAAFLKKSGKLKVPEWVDTVKLAKHKELAPYDENWFYTRAASTARHLYLRGGAGVGSMTKIYGGRQRNGVMPSHFSRGSKSVARRVLQALEGLKMVEKDQDGGRKLTPQGQRDLDRIAGQVAAANKKH,16050.53475469,16060.49978,,,,,0
11842,RL35_HUMAN,P42766,60S ribosomal protein L35,P42766,,MAKIKARDLRGKKKEELLKQLDDLKVELSQLRVAKVTGGAASKLSKIRVVRKSIARVLTVINQTQKENLRKFYKGKKYKPLDLRPKKTRAMRRRLNKHEENLKTKKQQRKERLYPLRKYAVKA,0,122,123,MAKIKARDLRGKKKEELLKQLDDLKVELSQLRVAKVTGGAASKLSKIRVVRKSIARVLTVINQTQKENLRKFYKGKKYKPLDLRPKKTRAMRRRLNKHEENLKTKKQQRKERLYPLRKYAVKA,14542.55999469,14551.47758,,,,,0
11843,RS10_HUMAN,P46783,40S ribosomal protein S10,P46783,,MLMPKKNRIAIYELLFKEGVMVAKKDVHMPKHPELADKNVPNLHVMKAMQSLKSRGYVKEQFAWRHFYWYLTNEGIQYLRDYLHLPPEIVPATLRRSRPETGRPRPKGLEGERPARLTRGEADRDTYRRSAVPPGADKKAEAGAGSATEFQFRGGFGRGRGQPPQ,1,164,164,LMPKKNRIAIYELLFKEGVMVAKKDVHMPKHPELADKNVPNLHVMKAMQSLKSRGYVKEQFAWRHFYWYLTNEGIQYLRDYLHLPPEIVPATLRRSRPETGRPRPKGLEGERPARLTRGEADRDTYRRSAVPPGADKKAEAGAGSATEFQFRGGFGRGRGQPPQ,18852.89886969,18864.72148,,PSI-MOD:394@0|PSI-MOD:429@156|PSI-MOD:429@158,,,0
11844,RL34_HUMAN,P49207,60S ribosomal protein L34,P49207,,MVQRLTYRRRLSYNTASNKTRLSRTPGNRIVYLYTKKVGKAPKSACGVCPGRLRGVRAVRPKVLMRLSKTKKHVSRAYGGSMCAKCVRDRIKRAFLIEEQKIVVKVLKAQAQSQKAK,0,116,117,MVQRLTYRRRLSYNTASNKTRLSRTPGNRIVYLYTKKVGKAPKSACGVCPGRLRGVRAVRPKVLMRLSKTKKHVSRAYGGSMCAKCVRDRIKRAFLIEEQKIVVKVLKAQAQSQKAK,13284.47207469,13292.95378,,,,,0
11845,HINT1_HUMAN,P49773,Histidine triad nucleotide-binding protein 1,P49773,,MADEIAKAQVARPGGDTIFGKIIRKEIPAKIIFEDDRCLAFHDISPQAPTHFLVIPKKHISQISVAEDDDESLLGHLMIVGKKCAADLGLNKGYRMVVNEGSDGGQSVYHVHLHVLGGRQMHWPPG,0,125,126,MADEIAKAQVARPGGDTIFGKIIRKEIPAKIIFEDDRCLAFHDISPQAPTHFLVIPKKHISQISVAEDDDESLLGHLMIVGKKCAADLGLNKGYRMVVNEGSDGGQSVYHVHLHVLGGRQMHWPPG,13793.09357469,13801.90798,,,,,0
11846,68MP_HUMAN,P56378,6.8 kDa mitochondrial proteolipid,P56378-1,1,MLQSIIKNIWIPMKPYYTKVYQEIWIGMGLMGFIVYKIRAADKRSKALKASAPAPGHH,1,57,57,LQSIIKNIWIPMKPYYTKVYQEIWIGMGLMGFIVYKIRAADKRSKALKASAPAPGHH,6526.55155469,6530.85078,,,,,1
11847,UBE2N_MOUSE,P61089,Ubiquitin-conjugating enzyme E2 N,P61089,,MAGLPRRIIKETQRLLAEPVPGIKAEPDESNARYFHVVIAGPQDSPFEGGTFKLELFLPEEYPMAAPKVRFMTKIYHPNVDKLGRICLDILKDKWSPALQIRTVLLSIQALLSAPNPDDPLANDVAEQWKTNEAQAIETARAWTRLYAMNNI,1,151,151,AGLPRRIIKETQRLLAEPVPGIKAEPDESNARYFHVVIAGPQDSPFEGGTFKLELFLPEEYPMAAPKVRFMTKIYHPNVDKLGRICLDILKDKWSPALQIRTVLLSIQALLSAPNPDDPLANDVAEQWKTNEAQAIETARAWTRLYAMNNI,17037.94420969,17048.66868,,PSI-MOD:394@0,,,0
11848,B2MG_HUMAN,P61769,Beta-2-microglobulin,P61769,,MSRSVALAVLALLSLSGLEAIQRTPKIQVYSRHPAENGKSNFLNCYVSGFHPSDIEVDLLKNGERIEKVEHSDLSFSKDWSFYLLYYTEFTPTEKDEYACRVNHVTLSQPKIVKWDRDM,20,118,99,IQRTPKIQVYSRHPAENGKSNFLNCYVSGFHPSDIEVDLLKNGERIEKVEHSDLSFSKDWSFYLLYYTEFTPTEKDEYACRVNHVTLSQPKIVKWDRDM,11723.78730469,11731.16798,,PSI-MOD:18@71,,,0
11849,TIM10_HUMAN,P62072,Mitochondrial import inner membrane translocase subunit Tim10,P62072,,MDPLRAQQLAAELEVEMMADMYNRMTSACHRKCVPPHYKEAELSKGESVCLDRCVSKYLDIHERMGKKLTELSMQDEELMKRVQQSSGPA,0,89,90,MDPLRAQQLAAELEVEMMADMYNRMTSACHRKCVPPHYKEAELSKGESVCLDRCVSKYLDIHERMGKKLTELSMQDEELMKRVQQSSGPA,10367.95374969,10374.99028,,PSI-MOD:394@0,,,0
11850,CALM_HUMAN,P62158,Calmodulin,P62158,,MADQLTEEQIAEFKEAFSLFDKDGDGTITTKELGTVMRSLGQNPTEAELQDMINEVDADGNGTIDFPEFLTMMARKMKDTDSEEEIREAFRVFDKDGNGYISAAELRHVMTNLGEKLTDEEVDEMIREADIDGDGQVNYEEFVQMMTAK,1,148,148,ADQLTEEQIAEFKEAFSLFDKDGDGTITTKELGTVMRSLGQNPTEAELQDMINEVDADGNGTIDFPEFLTMMARKMKDTDSEEEIREAFRVFDKDGNGYISAAELRHVMTNLGEKLTDEEVDEMIREADIDGDGQVNYEEFVQMMTAK,16778.84324531,16789.50690362,,PSI-MOD:394@0|PSI-MOD:855@114,,,0
11851,RS16_HUMAN,P62249,40S ribosomal protein S16,P62249,,MPSKGPLQSVQVFGRKKTATAVAHCKRGNGLIKVNGRPLEMIEPRTLQYKLLEPVLLLGKERFAGVDIRVRVKGGGHVAQIYAIRQSISKALVAYYQKYVDEASKKEIKDILIQYDRTLLVADPRRCESKKFGGPGARARYQKSYR,0,145,146,MPSKGPLQSVQVFGRKKTATAVAHCKRGNGLIKVNGRPLEMIEPRTLQYKLLEPVLLLGKERFAGVDIRVRVKGGGHVAQIYAIRQSISKALVAYYQKYVDEASKKEIKDILIQYDRTLLVADPRRCESKKFGGPGARARYQKSYR,16435.04063469,16445.31638,,,,,1
11852,RS13_HUMAN,P62277,40S ribosomal protein S13,P62277,,MGRMHAPGKGLSQSALPYRRSVPTWLKLTSDDVKEQIYKLAKKGLTPSQIGVILRDSHGVAQVRFVTGNKILRILKSKGLAPDLPEDLYHLIKKAVAVRKHLERNRKDKDAKFRLILIESRIHRLARYYKTKRVLPPNWKYESSTASALVA,0,150,151,MGRMHAPGKGLSQSALPYRRSVPTWLKLTSDDVKEQIYKLAKKGLTPSQIGVILRDSHGVAQVRFVTGNKILRILKSKGLAPDLPEDLYHLIKKAVAVRKHLERNRKDKDAKFRLILIESRIHRLARYYKTKRVLPPNWKYESSTASALVA,17211.66624469,17222.30668,,,,,0
11853,LSM6_HUMAN,P62312,U6 snRNA-associated Sm-like protein LSm6,P62312,,MSLRKQTPSDFLKQIIGRPVVVKLNSGVDYRGVLACLDGYMNIALEQTEEYVNGQLKNKYGDAFIRGNNVLYISTQKRRM,0,79,80,MSLRKQTPSDFLKQIIGRPVVVKLNSGVDYRGVLACLDGYMNIALEQTEEYVNGQLKNKYGDAFIRGNNVLYISTQKRRM,9121.76700469,9127.57348,,,,,0
11854,SMD1_HUMAN,P62314,Small nuclear ribonucleoprotein Sm D1,P62314,,MKLVRFLMKLSHETVTIELKNGTQVHGTITGVDVSMNTHLKAVKMTLKNREPVQLETLSIRGNNIRYFILPDSLPLDTLLVDVEPKVKSKKREAVAGRGRGRGRGRGRGRGRGRGGPRR,1,118,118,KLVRFLMKLSHETVTIELKNGTQVHGTITGVDVSMNTHLKAVKMTLKNREPVQLETLSIRGNNIRYFILPDSLPLDTLLVDVEPKVKSKKREAVAGRGRGRGRGRGRGRGRGRGGPRR,13436.61553969,13444.86748,,PSI-MOD:394@0|PSI-MOD:429@96|PSI-MOD:429@98|PSI-MOD:429@100|PSI-MOD:429@102|PSI-MOD:429@104|PSI-MOD:429@106|PSI-MOD:429@108|PSI-MOD:429@110|PSI-MOD:429@112,,,0
11855,H4_HUMAN,P62805,Histone H4,P62805,,MSGRGKGGKGLGKGGAKRHRKVLRDNIQGITKPAIRRLARRGGVKRISGLIYEETRGVLKVFLENVIRDAVTYTEHAKRKTVTAMDVVYALKRQGRTLYGFGG,1,102,102,SGRGKGGKGLGKGGAKRHRKVLRDNIQGITKPAIRRLARRGGVKRISGLIYEETRGVLKVFLENVIRDAVTYTEHAKRKTVTAMDVVYALKRQGRTLYGFGG,11341.39344469,11348.28188,,PSI-MOD:394@0|PSI-MOD:394@15|PSI-MOD:429@19,,,0
11856,RL23_HUMAN,P62829,60S ribosomal protein L23,P62829,,MSKRGRGGSSGAKFRISLGLPVGAVINCADNTGAKNLYIISVKGIKGRLNRLPAAGVGDMVMATVKKGKPELRKKVHPAVVIRQRKSYRRKDGVFLYFEDNAGVIVNNKGEMKGSAITGPVAKECADLWPRIASNAGSIA,1,139,139,SKRGRGGSSGAKFRISLGLPVGAVINCADNTGAKNLYIISVKGIKGRLNRLPAAGVGDMVMATVKKGKPELRKKVHPAVVIRQRKSYRRKDGVFLYFEDNAGVIVNNKGEMKGSAITGPVAKECADLWPRIASNAGSIA,14767.03131969,14776.29138,,PSI-MOD:394@0,,,0
11857,RS28_HUMAN,P62857,40S ribosomal protein S28,P62857,,MDTSRVQPIKLARVTKVLGRTGSQGQCTQVRVEFMDDTSRSIIRNVKGPVREGDVLTLLESEREARRLR,0,68,69,MDTSRVQPIKLARVTKVLGRTGSQGQCTQVRVEFMDDTSRSIIRNVKGPVREGDVLTLLESEREARRLR,7878.21184969,7883.06668,,PSI-MOD:394@0,,,0
11858,RL32_HUMAN,P62910,60S ribosomal protein L32,P62910,,MAALRPLVKPKIVKKRTKKFIRHQSDRYVKIKRNWRKPRGIDNRVRRRFKGQILMPNIGYGSNKKTKHMLPSGFRKFLVHNVKELEVLLMCNKSYCAEIAHNVSSKNRKAIVERAAQLAIRVTNPNARLRSEENE,0,134,135,MAALRPLVKPKIVKKRTKKFIRHQSDRYVKIKRNWRKPRGIDNRVRRRFKGQILMPNIGYGSNKKTKHMLPSGFRKFLVHNVKELEVLLMCNKSYCAEIAHNVSSKNRKAIVERAAQLAIRVTNPNARLRSEENE,15849.80395469,15859.80238,,,,,1
11859,IF5A1_HUMAN,P63241,Eukaryotic translation initiation factor 5A-1,P63241-1,1,MADDLDFETGDAGASATFPMQCSALRKNGFVVLKGRPCKIVEMSTSKTGKHGHAKVHLVGIDIFTGKKYEDICPSTHNMDVPNIKRNDFQLIGIQDGYLSLLQDSGEVREDLRLPEGDLGKEIEQKYDCGEEILITVLSAMTEEAAVAIKAMAK,1,153,153,ADDLDFETGDAGASATFPMQCSALRKNGFVVLKGRPCKIVEMSTSKTGKHGHAKVHLVGIDIFTGKKYEDICPSTHNMDVPNIKRNDFQLIGIQDGYLSLLQDSGEVREDLRLPEGDLGKEIEQKYDCGEEILITVLSAMTEEAAVAIKAMAK,16819.44275369,16830.21728,,PSI-MOD:394@0|PSI-MOD:125@48,,,0
11860,H31_HUMAN,P68431,Histone H3.1,P68431,,MARTKQTARKSTGGKAPRKQLATKAARKSAPATGGVKKPHRYRPGTVALREIRRYQKSTELLIRKLPFQRLVREIAQDFKTDLRFQSSAVMALQEACEAYLVGLFEDTNLCAIHAKRVTIMPKDIQLARRIRGERA,1,135,135,ARTKQTARKSTGGKAPRKQLATKAARKSAPATGGVKKPHRYRPGTVALREIRRYQKSTELLIRKLPFQRLVREIAQDFKTDLRFQSSAVMALQEACEAYLVGLFEDTNLCAIHAKRVTIMPKDIQLARRIRGERA,15305.45316969,15314.93338,,PSI-MOD:394@0,,,0
11861,H2A2A_HUMAN,Q6FI13,Histone H2A type 2-A,Q6FI13,,MSGRGKQGGKARAKAKSRSSRAGLQFPVGRVHRLLRKGNYAERVGAGAPVYMAAVLEYLTAEILELAGNAARDNKKTRIIPRHLQLAIRNDEELNKLLGKVTIAQGGVLPNIQAVLLPKKTESHHKAKGK,1,129,129,SGRGKQGGKARAKAKSRSSRAGLQFPVGRVHRLLRKGNYAERVGAGAPVYMAAVLEYLTAEILELAGNAARDNKKTRIIPRHLQLAIRNDEELNKLLGKVTIAQGGVLPNIQAVLLPKKTESHHKAKGK,13997.85942969,14006.33558,,PSI-MOD:394@0,,,0
11862,TOM5_HUMAN,Q8N4H5,Mitochondrial import receptor subunit TOM5 homolog,Q8N4H5-1,1,MFRIEGLAPKLDPEEMKRKMREDVISSIRNFLIYVALLRVTPFILKKLDSI,0,50,51,MFRIEGLAPKLDPEEMKRKMREDVISSIRNFLIYVALLRVTPFILKKLDSI,6073.38135969,6077.34778,,PSI-MOD:394@0,,,0
11863,H2A1H_HUMAN,Q96KK5,Histone H2A type 1-H,Q96KK5,,MSGRGKQGGKARAKAKTRSSRAGLQFPVGRVHRLLRKGNYAERVGAGAPVYLAAVLEYLTAEILELAGNAARDNKKTRIIPRHLQLAIRNDEELNKLLGKVTIAQGGVLPNIQAVLLPKKTESHHKAK,1,127,127,SGRGKQGGKARAKAKTRSSRAGLQFPVGRVHRLLRKGNYAERVGAGAPVYLAAVLEYLTAEILELAGNAARDNKKTRIIPRHLQLAIRNDEELNKLLGKVTIAQGGVLPNIQAVLLPKKTESHHKAK,13808.80222969,13817.10328,,PSI-MOD:394@0,,,0
11864,S10AD_HUMAN,Q99584,Protein S100-A13,Q99584,,MAAEPLTELEESIETVVTTFFTFARQEGRKDSLSVNEFKELVTQQLPHLLKDVGSLDEKMKSLDVNQDSELKFNEYWRLIGELAKEIRKKKDLKIRKK,1,97,97,AAEPLTELEESIETVVTTFFTFARQEGRKDSLSVNEFKELVTQQLPHLLKDVGSLDEKMKSLDVNQDSELKFNEYWRLIGELAKEIRKKKDLKIRKK,11375.05974969,11382.03878,,PSI-MOD:394@0,,,0
11865,TOM7_HUMAN,Q9P0U1,Mitochondrial import receptor subunit TOM7 homolog,Q9P0U1,,MVKLSKEAKQRLQQLFKGSQFAIRWGFIPLVIYLGFKRGADPGMPEPTVLSLLWG,0,54,55,MVKLSKEAKQRLQQLFKGSQFAIRWGFIPLVIYLGFKRGADPGMPEPTVLSLLWG,6244.43649469,6248.49018,,,,,1
