PFR,UniProt Id,Entry Accession,Entry Description,Isoform Accession,Isoform Description,Isoform Sequence,Start,End,Length,Proteoform Sequence,Monoisotopic Mass,Average Mass,Sequence Modifications,PTMs,N-Terminal,C-Terminal,Star
1006,HMGN2_HUMAN,P05204,Non-histone chromosomal protein HMG-17,P05204,,MPKRKAEGDAKGDKAKVKDEPQRRSARLSAKPAPPKPEPKPKKAPAKKGEKVPKGKKGKADAGKEGNNPAENGDAKTDQAQKAEGAGDAK,1,89,89,PKRKAEGDAKGDKAKVKDEPQRRSARLSAKPAPPKPEPKPKKAPAKKGEKVPKGKKGKADAGKEGNNPAENGDAKTDQAQKAEGAGDAK,9256.01670469,9261.47728,,,,,1
1011,NEDD8_HUMAN,Q15843,NEDD8,Q15843,,MLIKVKTLTGKEIEIDIEPTDKVERIKERVEEKEGIPPQQQRLIYSGKQMNDEKTAADYKILGGSVLHLVLALRGGGGLRQ,0,75,76,MLIKVKTLTGKEIEIDIEPTDKVERIKERVEEKEGIPPQQQRLIYSGKQMNDEKTAADYKILGGSVLHLVLALRGG,8554.66613469,8559.97098,,,,,1
1012,RL30_HUMAN,P62888,60S ribosomal protein L30,P62888,,MVAAKKTKKSLESINSRLQLVMKSGKYVLGYKQTLKMIRQGKAKLVILANNCPALRKSEIEYYAMLAKTGVHHYSGNNIELGTACGKYYRVCTLAIIDPGDSDIIRSMPEQTGEK,1,114,114,VAAKKTKKSLESINSRLQLVMKSGKYVLGYKQTLKMIRQGKAKLVILANNCPALRKSEIEYYAMLAKTGVHHYSGNNIELGTACGKYYRVCTLAIIDPGDSDIIRSMPEQTGEK,12644.70093469,12652.85798,,,,,3
1013,SH3L1_HUMAN,O75368,SH3 domain-binding glutamic acid-rich-like protein,O75368,,MVIRVYIASSSGSTAIKKKQQDVLGFLEANKIGFEEKDIAANEENRKWMRENVPENSRPATGYPLPPQIFNESQYRGDYDAFFEARENNAVYAFLGLTAPPGSKEAEVQAKQQA,1,113,113,VIRVYIASSSGSTAIKKKQQDVLGFLEANKIGFEEKDIAANEENRKWMRENVPENSRPATGYPLPPQIFNESQYRGDYDAFFEARENNAVYAFLGLTAPPGSKEAEVQAKQQA,12635.33760469,12643.05928,,,,,1
1015,B2MG_HUMAN,P61769,Beta-2-microglobulin,P61769,,MSRSVALAVLALLSLSGLEAIQRTPKIQVYSRHPAENGKSNFLNCYVSGFHPSDIEVDLLKNGERIEKVEHSDLSFSKDWSFYLLYYTEFTPTEKDEYACRVNHVTLSQPKIVKWDRDM,20,118,99,IQRTPKIQVYSRHPAENGKSNFLNCYVSGFHPSDIEVDLLKNGERIEKVEHSDLSFSKDWSFYLLYYTEFTPTEKDEYACRVNHVTLSQPKIVKWDRDM,11723.78730469,11731.16798,,,,,1
1018,CX7A2_HUMAN,P14406,Cytochrome c oxidase subunit 7A2; mitochondrial,P14406,,MLRNLLALRQIGQRTISTASRRHFKNKVPEKQKLFQEDDEIPLYLKGGVADALLYRATMILTVGGTAYAIYELAVASFPKKQE,23,82,60,FKNKVPEKQKLFQEDDEIPLYLKGGVADALLYRATMILTVGGTAYAIYELAVASFPKKQE,6717.58107469,6721.81428,,,,,3
1021,COX5A_HUMAN,P20674,Cytochrome c oxidase subunit 5A; mitochondrial,P20674,,MLGAALRRCAVAATTRADPRGLLHSARTPGPAVAIQSVRCYSHGSQETDEEFDARWVTYFNKPDIDAWELRKGINTLVTYDMVPEPKIIDAALRACRRLNDFASTVRILEVVKDKAGPHKEIYPYVIQELRPTLNELGISTPEELGLDKV,41,149,109,SHGSQETDEEFDARWVTYFNKPDIDAWELRKGINTLVTYDMVPEPKIIDAALRACRRLNDFASTVRILEVVKDKAGPHKEIYPYVIQELRPTLNELGISTPEELGLDKV,12493.42618469,12501.17128,,,,,1
1022,HMGN1_HUMAN,P05114,Non-histone chromosomal protein HMG-14,P05114,,MPKRKVSSAEGAAKEEPKRRSARLSAKPPAKVEAKPKKAAAKDKSSDKKVQTKGKRGAKGKQAEVANQETKEDLPAENGETKTEESPASDEAGEKEAKSD,1,99,99,PKRKVSSAEGAAKEEPKRRSARLSAKPPAKVEAKPKKAAAKDKSSDKKVQTKGKRGAKGKQAEVANQETKEDLPAENGETKTEESPASDEAGEKEAKSD,10521.55253469,10527.70988,,,,,1
1028,ATPD_HUMAN,P30049,ATP synthase subunit delta; mitochondrial,P30049,,MLPAALLRRPGLGRLVRHARAYAEAAAAPAAASGPNQMSFTFASPTQVFFNGANVRQVDVPTLTGAFGILAAHVPTLQVLRPGLVVVHAEDGTTSKYFVSSGSIAVNADSSVQLLAEEAVTLDMLDLGAAKANLEKAQAELVGTADEATRAEIQIRIEANEALVKALE,22,167,146,AEAAAAPAAASGPNQMSFTFASPTQVFFNGANVRQVDVPTLTGAFGILAAHVPTLQVLRPGLVVVHAEDGTTSKYFVSSGSIAVNADSSVQLLAEEAVTLDMLDLGAAKANLEKAQAELVGTADEATRAEIQIRIEANEALVKALE,15010.73945469,15019.92938,,,,,1
1046,RL38_HUMAN,P63173,60S ribosomal protein L38,P63173,,MPRKIEEIKDFLLTARRKDAKSVKIKKNKDNVKFKVRCSRYLYTLVITDKEKAEKLKQSLPPGLAVKELK,1,69,69,PRKIEEIKDFLLTARRKDAKSVKIKKNKDNVKFKVRCSRYLYTLVITDKEKAEKLKQSLPPGLAVKELK,8081.69137469,8086.69548,,,,,3
1064,CX6A1_HUMAN,P12074,Cytochrome c oxidase subunit 6A1; mitochondrial,P12074,,MAVVGVSSVSRLLGRSRPQLGRPMSSGAHGEEGSARMWKTLTFFVALPGVAVSMLNVYLKSHHGEHERPEFIAYPHLRIRTKPFPWGDGNHTLFHNPHVNPLPTGYEDE,24,108,85,SSGAHGEEGSARMWKTLTFFVALPGVAVSMLNVYLKSHHGEHERPEFIAYPHLRIRTKPFPWGDGNHTLFHNPHVNPLPTGYEDE,9612.74298468999,9618.79678,,,,,1
1068,COX7B_HUMAN,P24311,Cytochrome c oxidase subunit 7B; mitochondrial,P24311,,MFPLVKSALNRLQVRSIQQTMARQSHQKRTPDFHDKYGNAVLASGATFCIVTWTYVATQVGIEWNLSPVGRVTPKEWRNQ,24,79,56,SHQKRTPDFHDKYGNAVLASGATFCIVTWTYVATQVGIEWNLSPVGRVTPKEWRNQ,6358.19221469,6362.14888,,,,,1
1101,ATP5E_HUMAN,P56381,ATP synthase subunit epsilon; mitochondrial,P56381,,MVAYWRQAGLSYIRYSQICAKAVRDALKTEFKANAEKTSGSNVKIVKVKKE,1,50,50,VAYWRQAGLSYIRYSQICAKAVRDALKTEFKANAEKTSGSNVKIVKVKKE,5645.06672469,5648.56968,,,,,1
1110,NDUB2_HUMAN,O95178,NADH dehydrogenase [ubiquinone] 1 beta subcomplex subunit 2; mitochondrial,O95178,,MSALTRLASFARVGGRLFRSGCARTAGDGGVRHAGGGVHIEPRYRQFPQLTRSQVFQSEFFSGLMWFWILWRFWHDSEEVLGHFPYPDPSQWTDEELGIPPDDED,33,104,72,AGGGVHIEPRYRQFPQLTRSQVFQSEFFSGLMWFWILWRFWHDSEEVLGHFPYPDPSQWTDEELGIPPDDED,8636.05538468999,8641.51028,,,,,1
1121,S10AB_HUMAN,P31949,Protein S100-A11,P31949,,MAKISSPTETERCIESLIAVFQKYAGKDGYNYTLSKTEFLSFMNTELAAFTKNQKDPGVLDRMMKKLDTNSDGQLDFSEFLNLIGGLAMACHDSFLKAVPSQKRT,0,104,105,MAKISSPTETERCIESLIAVFQKYAGKDGYNYTLSKTEFLSFMNTELAAFTKNQKDPGVLDRMMKKLDTNSDGQLDFSEFLNLIGGLAMACHDSFLKAVPSQKRT,11732.82494469,11740.44498,,,,,1
1128,DBLOH_HUMAN,Q9NR28,Diablo homolog; mitochondrial,Q9NR28-1,1,MAALKSWLSRSVTSFFRYRQCLCVPVVANFKKRCFSELIRPWHKTVTIGFGVTLCAVPIAQKSEPHSLSSEALMRRAVSLVTDSTSTFLSQTTYALIEAITEYTKAVYTLTSLYRQYTSLLGKMNSEEEDEVWQVIIGARAEMTSKHQEYLKLETTWMTAVGLSEMAAEAAYQTGADQASITARNHIQLVKLQVEEVHQLSRKAETKLAEAQIEELRQKTQEEGEERAESEQEAYLRED,55,238,184,AVPIAQKSEPHSLSSEALMRRAVSLVTDSTSTFLSQTTYALIEAITEYTKAVYTLTSLYRQYTSLLGKMNSEEEDEVWQVIIGARAEMTSKHQEYLKLETTWMTAVGLSEMAAEAAYQTGADQASITARNHIQLVKLQVEEVHQLSRKAETKLAEAQIEELRQKTQEEGEERAESEQEAYLRED,20752.38024469,20765.15828,,,,,1
1265,SC61B_HUMAN,P60468,Protein transport protein Sec61 subunit beta,P60468,,MPGPTPSGTNVGSSGRSPSKAVAARAAGSTVRQRKNASCGTRSAGRTTSAGTGGMWRFYTEDSPGLKVGPVPVLVMSLLFIASVFMLHIWGKYTRS,1,95,95,PGPTPSGTNVGSSGRSPSKAVAARAAGSTVRQRKNASCGTRSAGRTTSAGTGGMWRFYTEDSPGLKVGPVPVLVMSLLFIASVFMLHIWGKYTRS,9837.05683469,9843.25988,,,,,3
1293,H2B1C_HUMAN,P62807,Histone H2B type 1-C/E/F/G/I,P62807,,MPEPAKSAPAPKKGSKKAVTKAQKKDGKKRKRSRKESYSVYVYKVLKQVHPDTGISSKAMGIMNSFVNDIFERIAGEASRLAHYNKRSTITSREIQTAVRLLLPGELAKHAVSEGTKAVTKYTSSK,1,125,125,PEPAKSAPAPKKGSKKAVTKAQKKDGKKRKRSRKESYSVYVYKVLKQVHPDTGISSKAMGIMNSFVNDIFERIAGEASRLAHYNKRSTITSREIQTAVRLLLPGELAKHAVSEGTKAVTKYTSSK,13766.51678469,13774.94648,,,,,1
1321,ATIF1_HUMAN,Q9UII2,ATPase inhibitor; mitochondrial,Q9UII2-1,1,MAVTALAARTWLGVWGVRTMQARGFGSDQSENVDRGAGSIREAGGAFGKREQAEEERYFRAQSREQLAALKKHHEEEIVHHKKEIERLQKEIERHKQKIKMLKHDD,25,105,81,GSDQSENVDRGAGSIREAGGAFGKREQAEEERYFRAQSREQLAALKKHHEEEIVHHKKEIERLQKEIERHKQKIKMLKHDD,9510.87158469,9516.55968,,,,,1
1327,H2A1C_HUMAN,Q93077,Histone H2A type 1-C,Q93077,,MSGRGKQGGKARAKAKSRSSRAGLQFPVGRVHRLLRKGNYAERVGAGAPVYLAAVLEYLTAEILELAGNAARDNKKTRIIPRHLQLAIRNDEELNKLLGRVTIAQGGVLPNIQAVLLPKKTESHHKAKGK,1,129,129,SGRGKQGGKARAKAKSRSSRAGLQFPVGRVHRLLRKGNYAERVGAGAPVYLAAVLEYLTAEILELAGNAARDNKKTRIIPRHLQLAIRNDEELNKLLGRVTIAQGGVLPNIQAVLLPKKTESHHKAKGK,13993.92988469,14002.32578,,RESID:67@2,,,1
1330,H2B1D_HUMAN,P58876,Histone H2B type 1-D,P58876,,MPEPTKSAPAPKKGSKKAVTKAQKKDGKKRKRSRKESYSVYVYKVLKQVHPDTGISSKAMGIMNSFVNDIFERIAGEASRLAHYNKRSTITSREIQTAVRLLLPGELAKHAVSEGTKAVTKYTSSK,1,125,125,PEPTKSAPAPKKGSKKAVTKAQKKDGKKRKRSRKESYSVYVYKVLKQVHPDTGISSKAMGIMNSFVNDIFERIAGEASRLAHYNKRSTITSREIQTAVRLLLPGELAKHAVSEGTKAVTKYTSSK,13796.52735469,13804.97278,,,,,1
1331,QCR6_HUMAN,P07919,Cytochrome b-c1 complex subunit 6; mitochondrial,P07919,,MGLEDEQKMLTESGDPEEEEEEEEELVDPLTTVREQCEQLEKCVKARERLELCDERVSSRSHTEEDCTEELFDFLHARDHCVAHKLFNNLK,13,90,78,GDPEEEEEEEEELVDPLTTVREQCEQLEKCVKARERLELCDERVSSRSHTEEDCTEELFDFLHARDHCVAHKLFNNLK,9240.28146469,9246.09428,,,,,1
1332,SODM_HUMAN,P04179,Superoxide dismutase [Mn]; mitochondrial,P04179-1,1,MLSRAVCGTSRQLAPALGYLGSRQKHSLPDLPYDYGALEPHINAQIMQLHHSKHHAAYVNNLNVTEEKYQEALAKGDVTAQIALQPALKFNGGGHINHSIFWTNLSPNGGGEPKGELLEAIKRDFGSFDKFKEKLTAASVGVQGSGWGWLGFNKERGHLQIAACPNQDPLQGTTGLIPLLGIDVWEHAYYLQYKNVRPDYLKAIWNVINWENVTERYMACKK,24,221,198,KHSLPDLPYDYGALEPHINAQIMQLHHSKHHAAYVNNLNVTEEKYQEALAKGDVTAQIALQPALKFNGGGHINHSIFWTNLSPNGGGEPKGELLEAIKRDFGSFDKFKEKLTAASVGVQGSGWGWLGFNKERGHLQIAACPNQDPLQGTTGLIPLLGIDVWEHAYYLQYKNVRPDYLKAIWNVINWENVTERYMACKK,22190.24330469,22204.13898,,,,,1
1335,H2B2E_HUMAN,Q16778,Histone H2B type 2-E,Q16778,,MPEPAKSAPAPKKGSKKAVTKAQKKDGKKRKRSRKESYSIYVYKVLKQVHPDTGISSKAMGIMNSFVNDIFERIAGEASRLAHYNKRSTITSREIQTAVRLLLPGELAKHAVSEGTKAVTKYTSSK,1,125,125,PEPAKSAPAPKKGSKKAVTKAQKKDGKKRKRSRKESYSIYVYKVLKQVHPDTGISSKAMGIMNSFVNDIFERIAGEASRLAHYNKRSTITSREIQTAVRLLLPGELAKHAVSEGTKAVTKYTSSK,13780.53243469,13788.97328,,,,,1
1375,PEBP1_HUMAN,P30086,Phosphatidylethanolamine-binding protein 1,P30086,,MPVDLSKWSGPLSLQEVDEQPQHPLHVTYAGAAVDELGKVLTPTQVKNRPTSISWDGLDSGKLYTLVLTDPDAPSRKDPKYREWHHFLVVNMKGNDISSGTVLSDYVGSGPPKGTGLHRYVWLVYEQDRPLKCDEPILSNRSGDHRGKFKVASFRKKYELRAPVAGTCYQAEWDDYVPKLYEQLSGK,1,186,186,PVDLSKWSGPLSLQEVDEQPQHPLHVTYAGAAVDELGKVLTPTQVKNRPTSISWDGLDSGKLYTLVLTDPDAPSRKDPKYREWHHFLVVNMKGNDISSGTVLSDYVGSGPPKGTGLHRYVWLVYEQDRPLKCDEPILSNRSGDHRGKFKVASFRKKYELRAPVAGTCYQAEWDDYVPKLYEQLSGK,20912.62518469,20925.59218,,,,,1
1391,RS14_HUMAN,P62263,40S ribosomal protein S14,P62263,,MAPRKGKEKKEEQVISLGPQVAEGENVFGVCHIFASFNDTFVHVTDLSGKETICRVTGGMKVKADRDESSPYAAMLAAQDVAQRCKELGITALHIKLRATGGNRTKTPGPGAQSALRALARSGMKIGRIEDVTPIPSDSTRRKGGRRGRRL,1,150,150,APRKGKEKKEEQVISLGPQVAEGENVFGVCHIFASFNDTFVHVTDLSGKETICRVTGGMKVKADRDESSPYAAMLAAQDVAQRCKELGITALHIKLRATGGNRTKTPGPGAQSALRALARSGMKIGRIEDVTPIPSDSTRRKGGRRGRRL,16131.49203469,16141.51328,,,,,1
1449,H2B1O_HUMAN,P23527,Histone H2B type 1-O,P23527,,MPDPAKSAPAPKKGSKKAVTKAQKKDGKKRKRSRKESYSIYVYKVLKQVHPDTGISSKAMGIMNSFVNDIFERIAGEASRLAHYNKRSTITSREIQTAVRLLLPGELAKHAVSEGTKAVTKYTSSK,1,125,125,PDPAKSAPAPKKGSKKAVTKAQKKDGKKRKRSRKESYSIYVYKVLKQVHPDTGISSKAMGIMNSFVNDIFERIAGEASRLAHYNKRSTITSREIQTAVRLLLPGELAKHAVSEGTKAVTKYTSSK,13766.51678469,13774.94638,,,,,1
1470,QCR9_HUMAN,Q9UDW1,Cytochrome b-c1 complex subunit 9,Q9UDW1-1,1,MAAATLTSKLYSLLFRRTSTFALTIIVGVMFFERAFDQGADAIYDHINEGKLWKHIKHKYENK,1,62,62,AAATLTSKLYSLLFRRTSTFALTIIVGVMFFERAFDQGADAIYDHINEGKLWKHIKHKYENK,7172.78537469,7177.29908,,,,,1
1610,H2A1B_HUMAN,P04908,Histone H2A type 1-B/E,P04908,,MSGRGKQGGKARAKAKTRSSRAGLQFPVGRVHRLLRKGNYSERVGAGAPVYLAAVLEYLTAEILELAGNAARDNKKTRIIPRHLQLAIRNDEELNKLLGRVTIAQGGVLPNIQAVLLPKKTESHHKAKGK,1,129,129,SGRGKQGGKARAKAKTRSSRAGLQFPVGRVHRLLRKGNYSERVGAGAPVYLAAVLEYLTAEILELAGNAARDNKKTRIIPRHLQLAIRNDEELNKLLGRVTIAQGGVLPNIQAVLLPKKTESHHKAKGK,13995.90915469,14004.30208,,,,,1
1724,COX8A_HUMAN,P10176,Cytochrome c oxidase subunit 8A; mitochondrial,P10176,,MSVLTPLLLRGLTGSARRLPVPRAKIHSLPPEGKLGIMELAVGLTSCFVTFLLPAGWILSHLETYRRPE,25,68,44,IHSLPPEGKLGIMELAVGLTSCFVTFLLPAGWILSHLETYRRPE,4890.59677469,4893.78288,,,,,1
1764,H2B1H_HUMAN,Q93079,Histone H2B type 1-H,Q93079,,MPDPAKSAPAPKKGSKKAVTKAQKKDGKKRKRSRKESYSVYVYKVLKQVHPDTGISSKAMGIMNSFVNDIFERIAGEASRLAHYNKRSTITSREIQTAVRLLLPGELAKHAVSEGTKAVTKYTSSK,1,125,125,PDPAKSAPAPKKGSKKAVTKAQKKDGKKRKRSRKESYSVYVYKVLKQVHPDTGISSKAMGIMNSFVNDIFERIAGEASRLAHYNKRSTITSREIQTAVRLLLPGELAKHAVSEGTKAVTKYTSSK,13752.50113469,13760.91958,,,,,1
1862,MIF_HUMAN,P14174,Macrophage migration inhibitory factor,P14174,,MPMFIVNTNVPRASVPDGFLSELTQQLAQATGKPPQYIAVHVVPDQLMAFGGSSEPCALCSLHSIGKIGGAQNRSYSKLLCGLLAERLRISPDRVYINYYDMNAANVGWNNSTFA,1,114,114,PMFIVNTNVPRASVPDGFLSELTQQLAQATGKPPQYIAVHVVPDQLMAFGGSSEPCALCSLHSIGKIGGAQNRSYSKLLCGLLAERLRISPDRVYINYYDMNAANVGWNNSTFA,12337.17865469,12345.10708,,,,,1
1865,RL22_HUMAN,P35268,60S ribosomal protein L22,P35268,,MAPVKKLVVKGGKKKKQVLKFTLDCTHPVEDGIMDAANFEQFLQERIKVNGKAGNLGGGVVTIERSKSKITVTSEVPFSKRYLKYLTKKYLKKNNLRDWLRVVANSKESYELRYFQINQDEEEEEDED,1,127,127,APVKKLVVKGGKKKKQVLKFTLDCTHPVEDGIMDAANFEQFLQERIKVNGKAGNLGGGVVTIERSKSKITVTSEVPFSKRYLKYLTKKYLKKNNLRDWLRVVANSKESYELRYFQINQDEEEEEDED,14646.76337469,14655.79938,,,,,1
1887,H2B1N_HUMAN,Q99877,Histone H2B type 1-N,Q99877,,MPEPSKSAPAPKKGSKKAVTKAQKKDGKKRKRSRKESYSVYVYKVLKQVHPDTGISSKAMGIMNSFVNDIFERIAGEASRLAHYNKRSTITSREIQTAVRLLLPGELAKHAVSEGTKAVTKYTSSK,1,125,125,PEPSKSAPAPKKGSKKAVTKAQKKDGKKRKRSRKESYSVYVYKVLKQVHPDTGISSKAMGIMNSFVNDIFERIAGEASRLAHYNKRSTITSREIQTAVRLLLPGELAKHAVSEGTKAVTKYTSSK,13782.51170469,13790.94588,,,,,1
1942,RS17_HUMAN,P08708,40S ribosomal protein S17,P08708,,MGRVRTKTVKKAARVIIEKYYTRLGNDFHTNKRVCEEIAIIPSKKLRNKIAGYVTHLMKRIQRGPVRGISIKLQEEERERRDNYVPEVSALDQEIIEVDPDTKEMLKLLDFGSLSNLQVTQPTVGMNFKTPRGPV,1,134,134,GRVRTKTVKKAARVIIEKYYTRLGNDFHTNKRVCEEIAIIPSKKLRNKIAGYVTHLMKRIQRGPVRGISIKLQEEERERRDNYVPEVSALDQEIIEVDPDTKEMLKLLDFGSLSNLQVTQPTVGMNFKTPRGPV,15409.34911469,15418.92868,,,,,1
1945,ZN706_HUMAN,Q9Y5V0,Zinc finger protein 706,Q9Y5V0,,MARGQQKIQSQQKNAKKQAGQKKKQGHDQKAAAKAALIYTCTVCRTQMPDPKTFKQHFESKHPKTPLPPELADVQA,1,75,75,ARGQQKIQSQQKNAKKQAGQKKKQGHDQKAAAKAALIYTCTVCRTQMPDPKTFKQHFESKHPKTPLPPELADVQA,8361.40652469,8366.63328,,,,,1
1976,NDUA4_HUMAN,O00483,Cytochrome c oxidase subunit NDUFA4,O00483,,MLRQIIGQAKKHPSLIPLFVFIGTGATGATLYLLRLALFNPDVCWDRNNPEPWNKLGPNDQYKFYSVNVDYSKLKKERPDF,0,80,81,MLRQIIGQAKKHPSLIPLFVFIGTGATGATLYLLRLALFNPDVCWDRNNPEPWNKLGPNDQYKFYSVNVDYSKLKKERPDF,9363.91017468999,9369.86228,,,,,1
2119,RS19_HUMAN,P39019,40S ribosomal protein S19,P39019,,MPGVTVKDVNQQEFVRALAAFLKKSGKLKVPEWVDTVKLAKHKELAPYDENWFYTRAASTARHLYLRGGAGVGSMTKIYGGRQRNGVMPSHFSRGSKSVARRVLQALEGLKMVEKDQDGGRKLTPQGQRDLDRIAGQVAAANKKH,1,144,144,PGVTVKDVNQQEFVRALAAFLKKSGKLKVPEWVDTVKLAKHKELAPYDENWFYTRAASTARHLYLRGGAGVGSMTKIYGGRQRNGVMPSHFSRGSKSVARRVLQALEGLKMVEKDQDGGRKLTPQGQRDLDRIAGQVAAANKKH,15919.49426469,15929.30718,,,,,1
2180,ATP5I_HUMAN,P56385,ATP synthase subunit e; mitochondrial,P56385,,MVPPVQVSPLIKLGRYSALFLGVAYGATRYNYLKPRAEEERRIAAEEKKKQDELKRIARELAEDDSILK,1,68,68,VPPVQVSPLIKLGRYSALFLGVAYGATRYNYLKPRAEEERRIAAEEKKKQDELKRIARELAEDDSILK,7797.28484469,7802.01788,,,,,1
2408,RS16_HUMAN,P62249,40S ribosomal protein S16,P62249,,MPSKGPLQSVQVFGRKKTATAVAHCKRGNGLIKVNGRPLEMIEPRTLQYKLLEPVLLLGKERFAGVDIRVRVKGGGHVAQIYAIRQSISKALVAYYQKYVDEASKKEIKDILIQYDRTLLVADPRRCESKKFGGPGARARYQKSYR,1,145,145,PSKGPLQSVQVFGRKKTATAVAHCKRGNGLIKVNGRPLEMIEPRTLQYKLLEPVLLLGKERFAGVDIRVRVKGGGHVAQIYAIRQSISKALVAYYQKYVDEASKKEIKDILIQYDRTLLVADPRRCESKKFGGPGARARYQKSYR,16304.00014469,16314.12378,,,,,1
2463,S10A8_HUMAN,P05109,Protein S100-A8,P05109,,MLTELEKALNSIIDVYHKYSLIKGNFHAVYRDDLKKLLETECPQYIRKKGADVWFKELDINTDGAVNFQEFLILVIKMGVAAHKKSHEESHKE,0,92,93,MLTELEKALNSIIDVYHKYSLIKGNFHAVYRDDLKKLLETECPQYIRKKGADVWFKELDINTDGAVNFQEFLILVIKMGVAAHKKSHEESHKE,10827.64902469,10834.51088,,,,,1
2671,RS29_HUMAN,P62273,40S ribosomal protein S29,P62273-1,1,MGHQQLYWSHPRKFGQGSRSCRVCSNRHGLIRKYGLNMCRQCFRQYAKDIGFIKLD,1,55,55,GHQQLYWSHPRKFGQGSRSCRVCSNRHGLIRKYGLNMCRQCFRQYAKDIGFIKLD,6541.26290469,6545.57268,,,,,1
2700,BTF3_HUMAN,P20290,Transcription factor BTF3,P20290-2,2,MKETIMNQEKLAKLQAQVRIGGKGTARRKKKVVHRTATADDKKLQFSLKKLGVNNISGIEEVNMFTNQGTVIHFNNPKVQASLAANTFTITGHAETKQLTEMLPSILNQLGADSLTSLRRLAEALPKQSVDGKAPLATGEDDDDEVPDLVENFDEASKNEAN,0,161,162,MKETIMNQEKLAKLQAQVRIGGKGTARRKKKVVHRTATADDKKLQFSLKKLGVNNISGIEEVNMFTNQGTVIHFNNPKVQASLAANTFTITGHAETKQLTEMLPSILNQLGADSLTSLRRLAEALPKQSVDGKAPLATGEDDDDEVPDLVENFDEASKNEAN,17688.20590469,17699.04388,,,,,1
2859,SRP14_HUMAN,P37108,Signal recognition particle 14 kDa protein,P37108,,MVLLESEQFLTELTRLFQKCRTSGSVYITLKKYDGRTKPIPKKGTVEGFEPADNKCLLRATDGKKKISTVVSSKEVNKFQMAYSNLLRANMDGLKKRDKKNKTKKTKAAAAAAAAAPAAAATAPTTAATTAATAAQ,1,135,135,VLLESEQFLTELTRLFQKCRTSGSVYITLKKYDGRTKPIPKKGTVEGFEPADNKCLLRATDGKKKISTVVSSKEVNKFQMAYSNLLRANMDGLKKRDKKNKTKKTKAAAAAAAAAPAAAATAPTTAATTAATAAQ,14429.77621469,14438.73958,,,,,1
2863,FKB1A_HUMAN,P62942,Peptidyl-prolyl cis-trans isomerase FKBP1A,P62942,,MGVQVETISPGDGRTFPKRGQTCVVHYTGMLEDGKKFDSSRDRNKPFKFMLGKQEVIRGWEEGVAQMSVGQRAKLTISPDYAYGATGHPGIIPPHATLVFDVELLKLE,1,107,107,GVQVETISPGDGRTFPKRGQTCVVHYTGMLEDGKKFDSSRDRNKPFKFMLGKQEVIRGWEEGVAQMSVGQRAKLTISPDYAYGATGHPGIIPPHATLVFDVELLKLE,11812.04341469,11819.51308,,,,,1
2907,BAP31_HUMAN,P51572,B-cell receptor-associated protein 31,P51572-1,1,MSLQWTAVATFLYAEVFVVLLLCIPFISPKRWQKIFKSRLVELLVSYGNTFFVVLIVILVLLVIDAVREIRKYDDVTEKVNLQNNPGAMEHFHMKLFRAQRNLYIAGFSLLLSFLLRRLVTLISQQATLLASNEAFKKQAESASEAAKKYMEENDQLKKGAAVDGGKLDVGNAEVKLEEENRSLKADLQKLKDELASTKQKLEKAENQVLAMRKQSEGLTKEYDRLLEEHAKLQAAVDGPMDKKEE,1,245,245,SLQWTAVATFLYAEVFVVLLLCIPFISPKRWQKIFKSRLVELLVSYGNTFFVVLIVILVLLVIDAVREIRKYDDVTEKVNLQNNPGAMEHFHMKLFRAQRNLYIAGFSLLLSFLLRRLVTLISQQATLLASNEAFKKQAESASEAAKKYMEENDQLKKGAAVDGGKLDVGNAEVKLEEENRSLKADLQKLKDELASTKQKLEKAENQVLAMRKQSEGLTKEYDRLLEEHAKLQAAVDGPMDKKEE,27842.97061469,27860.41548,,,,,1
2930,H2B1B_HUMAN,P33778,Histone H2B type 1-B,P33778,,MPEPSKSAPAPKKGSKKAITKAQKKDGKKRKRSRKESYSIYVYKVLKQVHPDTGISSKAMGIMNSFVNDIFERIAGEASRLAHYNKRSTITSREIQTAVRLLLPGELAKHAVSEGTKAVTKYTSSK,1,125,125,PEPSKSAPAPKKGSKKAITKAQKKDGKKRKRSRKESYSIYVYKVLKQVHPDTGISSKAMGIMNSFVNDIFERIAGEASRLAHYNKRSTITSREIQTAVRLLLPGELAKHAVSEGTKAVTKYTSSK,13810.54300469,13818.99948,,,,,1
3051,PPIA_HUMAN,P62937,Peptidyl-prolyl cis-trans isomerase A,P62937-1,1,MVNPTVFFDIAVDGEPLGRVSFELFADKVPKTAENFRALSTGEKGFGYKGSCFHRIIPGFMCQGGDFTRHNGTGGKSIYGEKFEDENFILKHTGPGILSMANAGPNTNGSQFFICTAKTEWLDGKHVVFGKVKEGMNIVEAMERFGSRNGKTSKKITIADCGQLE,1,164,164,VNPTVFFDIAVDGEPLGRVSFELFADKVPKTAENFRALSTGEKGFGYKGSCFHRIIPGFMCQGGDFTRHNGTGGKSIYGEKFEDENFILKHTGPGILSMANAGPNTNGSQFFICTAKTEWLDGKHVVFGKVKEGMNIVEAMERFGSRNGKTSKKITIADCGQLE,17869.84447469,17881.30238,,,,,1
3081,EMRE_HUMAN,Q9H4I9,Essential MCU regulator; mitochondrial,Q9H4I9,,MASGAARWLVLAPVRSGALRSGPSLRKDGDVSAAWSGSGRSLVPSRSVIVTRSGAILPKPVKMSFGLLRVFSIVIPFLYVGTLISKNFAALLEEHDIFVPEDDDDDD,47,106,60,VIVTRSGAILPKPVKMSFGLLRVFSIVIPFLYVGTLISKNFAALLEEHDIFVPEDDDDDD,6673.54360469,6677.75808,,,,,1
3195,TYB10_HUMAN,P63313,Thymosin beta-10,P63313,,MADKPDMGEIASFDKAKLKKTETQEKNTLPTKETIEQEKRSEIS,1,43,43,ADKPDMGEIASFDKAKLKKTETQEKNTLPTKETIEQEKRSEIS,4891.51239469,4894.48308,,,,,1
3543,H4_HUMAN,P62805,Histone H4,P62805,,MSGRGKGGKGLGKGGAKRHRKVLRDNIQGITKPAIRRLARRGGVKRISGLIYEETRGVLKVFLENVIRDAVTYTEHAKRKTVTAMDVVYALKRQGRTLYGFGG,0,102,103,MSGRGKGGKGLGKGGAKRHRKVLRDNIQGITKPAIRRLARRGGVKRISGLIYEETRGVLKVFLENVIRDAVTYTEHAKRKTVTAMDVVYALKRQGRTLYGFGG,11360.38150469,11367.34448,,,,,1
3592,TYB10_HUMAN,P63313,Thymosin beta-10,P63313,,MADKPDMGEIASFDKAKLKKTETQEKNTLPTKETIEQEKRSEIS,0,43,44,MADKPDMGEIASFDKAKLKKTETQEKNTLPTKETIEQEKRSEIS,5022.55288469,5025.67568,,,,,1
3701,H2A1_HUMAN,P0C0S8,Histone H2A type 1,P0C0S8,,MSGRGKQGGKARAKAKTRSSRAGLQFPVGRVHRLLRKGNYAERVGAGAPVYLAAVLEYLTAEILELAGNAARDNKKTRIIPRHLQLAIRNDEELNKLLGKVTIAQGGVLPNIQAVLLPKKTESHHKAKGK,1,129,129,SGRGKQGGKARAKAKTRSSRAGLQFPVGRVHRLLRKGNYAERVGAGAPVYLAAVLEYLTAEILELAGNAARDNKKTRIIPRHLQLAIRNDEELNKLLGKVTIAQGGVLPNIQAVLLPKKTESHHKAKGK,13993.91864969,14002.32928,,RESID:55@4,,,1
3950,COX5B_HUMAN,P10606,Cytochrome c oxidase subunit 5B; mitochondrial,P10606,,MASRLLRGAGTLAAQALRARGPSGAAAMRSMASGGGVPTDEEQATGLEREIMLAAKKGLDPYNVLAPKGASGTREDPNLVPSISNKRIVGCICEEDNTSVVWFWLHKGEAQRCPRCGAHYKLVPQQLAH,31,128,98,ASGGGVPTDEEQATGLEREIMLAAKKGLDPYNVLAPKGASGTREDPNLVPSISNKRIVGCICEEDNTSVVWFWLHKGEAQRCPRCGAHYKLVPQQLAH,10606.30443469,10613.03738,,,,,1
4126,H2A1D_HUMAN,P20671,Histone H2A type 1-D,P20671,,MSGRGKQGGKARAKAKTRSSRAGLQFPVGRVHRLLRKGNYSERVGAGAPVYLAAVLEYLTAEILELAGNAARDNKKTRIIPRHLQLAIRNDEELNKLLGKVTIAQGGVLPNIQAVLLPKKTESHHKAKGK,0,129,130,MSGRGKQGGKARAKAKTRSSRAGLQFPVGRVHRLLRKGNYSERVGAGAPVYLAAVLEYLTAEILELAGNAARDNKKTRIIPRHLQLAIRNDEELNKLLGKVTIAQGGVLPNIQAVLLPKKTESHHKAKGK,14126.97479469,14135.53128,,RESID:67@3,,,1
4350,1433Z_HUMAN,P63104,14-3-3 protein zeta/delta,P63104-1,1,MDKNELVQKAKLAEQAERYDDMAACMKSVTEQGAELSNEERNLLSVAYKNVVGARRSSWRVVSSIEQKTEGAEKKQQMAREYREKIETELRDICNDVLSLLEKFLIPNASQAESKVFYLKMKGDYYRYLAEVAAGDDKKGIVDQSQQAYQEAFEISKKEMQPTHPIRLGLALNFSVFYYEILNSPEKACSLAKTAFDEAIAELDTLSEESYKDSTLIMQLLRDNLTLWTSDTQGDEAEAGEGGEN,0,244,245,MDKNELVQKAKLAEQAERYDDMAACMKSVTEQGAELSNEERNLLSVAYKNVVGARRSSWRVVSSIEQKTEGAEKKQQMAREYREKIETELRDICNDVLSLLEKFLIPNASQAESKVFYLKMKGDYYRYLAEVAAGDDKKGIVDQSQQAYQEAFEISKKEMQPTHPIRLGLALNFSVFYYEILNSPEKACSLAKTAFDEAIAELDTLSEESYKDSTLIMQLLRDNLTLWTSDTQGDEAEAGEGGEN,27769.73855969,27787.14458,,RESID:55@2,,,1
5507,HBB_HUMAN,P68871,Hemoglobin subunit beta,P68871,,MVHLTPEEKSAVTALWGKVNVDEVGGEALGRLLVVYPWTQRFFESFGDLSTPDAVMGNPKVKAHGKKVLGAFSDGLAHLDNLKGTFATLSELHCDKLHVDPENFRLLGNVLVCVLAHHFGKEFTPPVQAAYQKVVAGVANALAHKYH,1,146,146,VHLTPEEKSAVTALWGKVNVDEVGGEALGRLLVVYPWTQRFFESFGDLSTPDAVMGNPKVKAHGKKVLGAFSDGLAHLDNLKGTFATLSELHCDKLHVDPENFRLLGNVLVCVLAHHFGKEFTPPVQAAYQKVVAGVANALAHKYH,15857.24934469,15867.21558,,,,,1
6965,PTMA_HUMAN,P06454,Prothymosin alpha,P06454-2,2,MSDAAVDTSSEITTKDLKEKKEVVEEAENGRDAPANGNANEENGEQEADNEVDEEEEEGGEEEEEEEEGDGEEEDGDEDEEAESATGKRAAEDDEDDDVDTKKQKTDEDD,1,109,109,SDAAVDTSSEITTKDLKEKKEVVEEAENGRDAPANGNANEENGEQEADNEVDEEEEEGGEEEEEEEEGDGEEEDGDEDEEAESATGKRAAEDDEDDDVDTKKQKTDEDD,11977.89616969,11984.69348,,RESID:55@13,,,1
6968,TYB4_HUMAN,P62328,Thymosin beta-4,P62328,,MSDKPDMAEIEKFDKSKLKKTETQEKNPLPSKETIEQEKQAGES,1,43,43,SDKPDMAEIEKFDKSKLKKTETQEKNPLPSKETIEQEKQAGES,4960.48623969,4963.50238,,RESID:55@2,,,1
6972,H2B1K_HUMAN,O60814,Histone H2B type 1-K,O60814,,MPEPAKSAPAPKKGSKKAVTKAQKKDGKKRKRSRKESYSVYVYKVLKQVHPDTGISSKAMGIMNSFVNDIFERIAGEASRLAHYNKRSTITSREIQTAVRLLLPGELAKHAVSEGTKAVTKYTSAK,1,125,125,PEPAKSAPAPKKGSKKAVTKAQKKDGKKRKRSRKESYSVYVYKVLKQVHPDTGISSKAMGIMNSFVNDIFERIAGEASRLAHYNKRSTITSREIQTAVRLLLPGELAKHAVSEGTKAVTKYTSAK,13750.52186469,13758.94708,,,,,1
6976,ATP5I_HUMAN,P56385,ATP synthase subunit e; mitochondrial,P56385,,MVPPVQVSPLIKLGRYSALFLGVAYGATRYNYLKPRAEEERRIAAEEKKKQDELKRIARELAEDDSILK,0,68,69,MVPPVQVSPLIKLGRYSALFLGVAYGATRYNYLKPRAEEERRIAAEEKKKQDELKRIARELAEDDSILK,7928.32533469,7933.21048,,,,,1
6983,SERP1_HUMAN,Q9Y6X1,Stress-associated endoplasmic reticulum protein 1,Q9Y6X1,,MVAKQRIRMANEKHSKNITQRGNVAKTSRNAPEEKASVGPWLLALFIFVVCGSAIFQIIQSIRMGM,1,65,65,VAKQRIRMANEKHSKNITQRGNVAKTSRNAPEEKASVGPWLLALFIFVVCGSAIFQIIQSIRMGM,7237.88812469,7242.55928,,,,,1
6986,TYB10_HUMAN,P63313,Thymosin beta-10,P63313,,MADKPDMGEIASFDKAKLKKTETQEKNTLPTKETIEQEKRSEIS,1,43,43,ADKPDMGEIASFDKAKLKKTETQEKNTLPTKETIEQEKRSEIS,4933.52295969,4936.52308,,RESID:55@2,,,1
7000,TYB4_HUMAN,P62328,Thymosin beta-4,P62328,,MSDKPDMAEIEKFDKSKLKKTETQEKNPLPSKETIEQEKQAGES,0,43,44,MSDKPDMAEIEKFDKSKLKKTETQEKNPLPSKETIEQEKQAGES,5049.51616469,5052.65498,,,,,1
7325,H2A1C_HUMAN,Q93077,Histone H2A type 1-C,Q93077,,MSGRGKQGGKARAKAKSRSSRAGLQFPVGRVHRLLRKGNYAERVGAGAPVYLAAVLEYLTAEILELAGNAARDNKKTRIIPRHLQLAIRNDEELNKLLGRVTIAQGGVLPNIQAVLLPKKTESHHKAKGK,1,129,129,SGRGKQGGKARAKAKSRSSRAGLQFPVGRVHRLLRKGNYAERVGAGAPVYLAAVLEYLTAEILELAGNAARDNKKTRIIPRHLQLAIRNDEELNKLLGRVTIAQGGVLPNIQAVLLPKKTESHHKAKGK,14073.89621569,14082.30578,,RESID:37@0|RESID:67@2,,,1
7416,H2A3_HUMAN,Q7L7L0,Histone H2A type 3,Q7L7L0,,MSGRGKQGGKARAKAKSRSSRAGLQFPVGRVHRLLRKGNYSERVGAGAPVYLAAVLEYLTAEILELAGNAARDNKKTRIIPRHLQLAIRNDEELNKLLGRVTIAQGGVLPNIQAVLLPKKTESHHKAKGK,1,129,129,SGRGKQGGKARAKAKSRSSRAGLQFPVGRVHRLLRKGNYSERVGAGAPVYLAAVLEYLTAEILELAGNAARDNKKTRIIPRHLQLAIRNDEELNKLLGRVTIAQGGVLPNIQAVLLPKKTESHHKAKGK,14009.92480469,14018.32518,,RESID:67@2,,,1
8042,H2A1_HUMAN,P0C0S8,Histone H2A type 1,P0C0S8,,MSGRGKQGGKARAKAKTRSSRAGLQFPVGRVHRLLRKGNYAERVGAGAPVYLAAVLEYLTAEILELAGNAARDNKKTRIIPRHLQLAIRNDEELNKLLGKVTIAQGGVLPNIQAVLLPKKTESHHKAKGK,1,129,129,SGRGKQGGKARAKAKTRSSRAGLQFPVGRVHRLLRKGNYAERVGAGAPVYLAAVLEYLTAEILELAGNAARDNKKTRIIPRHLQLAIRNDEELNKLLGKVTIAQGGVLPNIQAVLLPKKTESHHKAKGK,13979.93938469,13988.33928,,RESID:67@2,,,1
11787,CYTA_HUMAN,P01040,Cystatin-A,P01040,,MIPGGLSEAKPATPEIQEIVDKVKPQLEEKTNETYGKLEAVQYKTQVVAGTNYYIKVRAGDNKYMHLKVFKSLPGQNEDLVLTGYQVDKNKDDELTGF,0,97,98,MIPGGLSEAKPATPEIQEIVDKVKPQLEEKTNETYGKLEAVQYKTQVVAGTNYYIKVRAGDNKYMHLKVFKSLPGQNEDLVLTGYQVDKNKDDELTGF,10999.66222469,11006.49278,,,,,1
11797,PROF1_HUMAN,P07737,Profilin-1,P07737,,MAGWNAYIDNLMADGTCQDAAIVGYKDSPSVWAAVPGKTFVNITPAEVGVLVGKDRSSFYVNGLTLGGQKCSVIRDSLLQDGEFSMDLRTKSTGGAPTFNVTVTKTDKTLVLLMGKEGVHGGLINKKCYEMASHLRRSQY,0,139,140,MAGWNAYIDNLMADGTCQDAAIVGYKDSPSVWAAVPGKTFVNITPAEVGVLVGKDRSSFYVNGLTLGGQKCSVIRDSLLQDGEFSMDLRTKSTGGAPTFNVTVTKTDKTLVLLMGKEGVHGGLINKKCYEMASHLRRSQY,15044.55581469,15054.23008,,,,,0
11815,H2A2C_HUMAN,Q16777,Histone H2A type 2-C,Q16777,,MSGRGKQGGKARAKAKSRSSRAGLQFPVGRVHRLLRKGNYAERVGAGAPVYMAAVLEYLTAEILELAGNAARDNKKTRIIPRHLQLAIRNDEELNKLLGKVTIAQGGVLPNIQAVLLPKKTESHKAKSK,0,128,129,MSGRGKQGGKARAKAKSRSSRAGLQFPVGRVHRLLRKGNYAERVGAGAPVYMAAVLEYLTAEILELAGNAARDNKKTRIIPRHLQLAIRNDEELNKLLGKVTIAQGGVLPNIQAVLLPKKTESHKAKSK,13979.84101469,13988.37338,,,,,0
12306,RL40_HUMAN,P62987,Ubiquitin-60S ribosomal protein L40,P62987,,MQIFVKTLTGKTITLEVEPSDTIENVKAKIQDKEGIPPDQQRLIFAGKQLEDGRTLSDYNIQKESTLHLVLRLRGGIIEPSLRQLAQKYNCDKMICRKCYARLHPRAVNCRKKKCGHTNNLRPKKKVK,0,75,76,MQIFVKTLTGKTITLEVEPSDTIENVKAKIQDKEGIPPDQQRLIFAGKQLEDGRTLSDYNIQKESTLHLVLRLRGG,8559.61656469,8564.84488,,,,,1