PFR,UniProt Id,Entry Accession,Entry Description,Isoform Accession,Isoform Description,Isoform Sequence,Start,End,Length,Proteoform Sequence,Monoisotopic Mass,Average Mass,Sequence Modifications,PTMs,N-Terminal,C-Terminal,Star
1011,NEDD8_HUMAN,Q15843,NEDD8,Q15843,,MLIKVKTLTGKEIEIDIEPTDKVERIKERVEEKEGIPPQQQRLIYSGKQMNDEKTAADYKILGGSVLHLVLALRGGGGLRQ,0,75,76,MLIKVKTLTGKEIEIDIEPTDKVERIKERVEEKEGIPPQQQRLIYSGKQMNDEKTAADYKILGGSVLHLVLALRGG,8554.66613469,8559.97098,,,,,1
1121,S10AB_HUMAN,P31949,Protein S100-A11,P31949,,MAKISSPTETERCIESLIAVFQKYAGKDGYNYTLSKTEFLSFMNTELAAFTKNQKDPGVLDRMMKKLDTNSDGQLDFSEFLNLIGGLAMACHDSFLKAVPSQKRT,0,104,105,MAKISSPTETERCIESLIAVFQKYAGKDGYNYTLSKTEFLSFMNTELAAFTKNQKDPGVLDRMMKKLDTNSDGQLDFSEFLNLIGGLAMACHDSFLKAVPSQKRT,11732.82494469,11740.44498,,,,,1
1788,H31_HUMAN,P68431,Histone H3.1,P68431,,MARTKQTARKSTGGKAPRKQLATKAARKSAPATGGVKKPHRYRPGTVALREIRRYQKSTELLIRKLPFQRLVREIAQDFKTDLRFQSSAVMALQEACEAYLVGLFEDTNLCAIHAKRVTIMPKDIQLARRIRGERA,0,135,136,MARTKQTARKSTGGKAPRKQLATKAARKSAPATGGVKKPHRYRPGTVALREIRRYQKSTELLIRKLPFQRLVREIAQDFKTDLRFQSSAVMALQEACEAYLVGLFEDTNLCAIHAKRVTIMPKDIQLARRIRGERA,15394.48309469,15404.08598,,,,,1
1859,H32_HUMAN,Q71DI3,Histone H3.2,Q71DI3,,MARTKQTARKSTGGKAPRKQLATKAARKSAPATGGVKKPHRYRPGTVALREIRRYQKSTELLIRKLPFQRLVREIAQDFKTDLRFQSSAVMALQEASEAYLVGLFEDTNLCAIHAKRVTIMPKDIQLARRIRGERA,0,135,136,MARTKQTARKSTGGKAPRKQLATKAARKSAPATGGVKKPHRYRPGTVALREIRRYQKSTELLIRKLPFQRLVREIAQDFKTDLRFQSSAVMALQEASEAYLVGLFEDTNLCAIHAKRVTIMPKDIQLARRIRGERA,15378.50593469,15388.02538,,,,,1
1905,H2B1H_HUMAN,Q93079,Histone H2B type 1-H,Q93079,,MPDPAKSAPAPKKGSKKAVTKAQKKDGKKRKRSRKESYSVYVYKVLKQVHPDTGISSKAMGIMNSFVNDIFERIAGEASRLAHYNKRSTITSREIQTAVRLLLPGELAKHAVSEGTKAVTKYTSSK,0,125,126,MPDPAKSAPAPKKGSKKAVTKAQKKDGKKRKRSRKESYSVYVYKVLKQVHPDTGISSKAMGIMNSFVNDIFERIAGEASRLAHYNKRSTITSREIQTAVRLLLPGELAKHAVSEGTKAVTKYTSSK,13883.54162469,13892.11218,,,,,1
1965,H2B1N_HUMAN,Q99877,Histone H2B type 1-N,Q99877,,MPEPSKSAPAPKKGSKKAVTKAQKKDGKKRKRSRKESYSVYVYKVLKQVHPDTGISSKAMGIMNSFVNDIFERIAGEASRLAHYNKRSTITSREIQTAVRLLLPGELAKHAVSEGTKAVTKYTSSK,0,125,126,MPEPSKSAPAPKKGSKKAVTKAQKKDGKKRKRSRKESYSVYVYKVLKQVHPDTGISSKAMGIMNSFVNDIFERIAGEASRLAHYNKRSTITSREIQTAVRLLLPGELAKHAVSEGTKAVTKYTSSK,13913.55219469,13922.13848,,,,,1
2233,H2B1O_HUMAN,P23527,Histone H2B type 1-O,P23527,,MPDPAKSAPAPKKGSKKAVTKAQKKDGKKRKRSRKESYSIYVYKVLKQVHPDTGISSKAMGIMNSFVNDIFERIAGEASRLAHYNKRSTITSREIQTAVRLLLPGELAKHAVSEGTKAVTKYTSSK,0,125,126,MPDPAKSAPAPKKGSKKAVTKAQKKDGKKRKRSRKESYSIYVYKVLKQVHPDTGISSKAMGIMNSFVNDIFERIAGEASRLAHYNKRSTITSREIQTAVRLLLPGELAKHAVSEGTKAVTKYTSSK,13897.55727469,13906.13898,,,,,1
2463,S10A8_HUMAN,P05109,Protein S100-A8,P05109,,MLTELEKALNSIIDVYHKYSLIKGNFHAVYRDDLKKLLETECPQYIRKKGADVWFKELDINTDGAVNFQEFLILVIKMGVAAHKKSHEESHKE,0,92,93,MLTELEKALNSIIDVYHKYSLIKGNFHAVYRDDLKKLLETECPQYIRKKGADVWFKELDINTDGAVNFQEFLILVIKMGVAAHKKSHEESHKE,10827.64902469,10834.51088,,,,,1
2674,H2A1C_HUMAN,Q93077,Histone H2A type 1-C,Q93077,,MSGRGKQGGKARAKAKSRSSRAGLQFPVGRVHRLLRKGNYAERVGAGAPVYLAAVLEYLTAEILELAGNAARDNKKTRIIPRHLQLAIRNDEELNKLLGRVTIAQGGVLPNIQAVLLPKKTESHHKAKGK,0,129,130,MSGRGKQGGKARAKAKSRSSRAGLQFPVGRVHRLLRKGNYAERVGAGAPVYLAAVLEYLTAEILELAGNAARDNKKTRIIPRHLQLAIRNDEELNKLLGRVTIAQGGVLPNIQAVLLPKKTESHHKAKGK,14096.93907469,14105.46838,,,,,1
2982,PPIA_HUMAN,P62937,Peptidyl-prolyl cis-trans isomerase A,P62937-1,1,MVNPTVFFDIAVDGEPLGRVSFELFADKVPKTAENFRALSTGEKGFGYKGSCFHRIIPGFMCQGGDFTRHNGTGGKSIYGEKFEDENFILKHTGPGILSMANAGPNTNGSQFFICTAKTEWLDGKHVVFGKVKEGMNIVEAMERFGSRNGKTSKKITIADCGQLE,0,164,165,MVNPTVFFDIAVDGEPLGRVSFELFADKVPKTAENFRALSTGEKGFGYKGSCFHRIIPGFMCQGGDFTRHNGTGGKSIYGEKFEDENFILKHTGPGILSMANAGPNTNGSQFFICTAKTEWLDGKHVVFGKVKEGMNIVEAMERFGSRNGKTSKKITIADCGQLE,18000.88496469,18012.49498,,,,,1
3400,H2A2A_HUMAN,Q6FI13,Histone H2A type 2-A,Q6FI13,,MSGRGKQGGKARAKAKSRSSRAGLQFPVGRVHRLLRKGNYAERVGAGAPVYMAAVLEYLTAEILELAGNAARDNKKTRIIPRHLQLAIRNDEELNKLLGKVTIAQGGVLPNIQAVLLPKKTESHHKAKGK,0,129,130,MSGRGKQGGKARAKAKSRSSRAGLQFPVGRVHRLLRKGNYAERVGAGAPVYMAAVLEYLTAEILELAGNAARDNKKTRIIPRHLQLAIRNDEELNKLLGKVTIAQGGVLPNIQAVLLPKKTESHHKAKGK,14086.88935469,14095.48818,,,,,1
3592,TYB10_HUMAN,P63313,Thymosin beta-10,P63313,,MADKPDMGEIASFDKAKLKKTETQEKNTLPTKETIEQEKRSEIS,0,43,44,MADKPDMGEIASFDKAKLKKTETQEKNTLPTKETIEQEKRSEIS,5022.55288469,5025.67568,,,,,1
3955,S10A4_HUMAN,P26447,Protein S100-A4,P26447,,MACPLEKALDVMVSTFHKYSGKEGDKFKLNKSELKELLTRELPSFLGKRTDEAAFQKLMSNLDSNRDNEVDFQEYCVFLSCIAMMCNEFFEGFPDKQPRKK,0,100,101,MACPLEKALDVMVSTFHKYSGKEGDKFKLNKSELKELLTRELPSFLGKRTDEAAFQKLMSNLDSNRDNEVDFQEYCVFLSCIAMMCNEFFEGFPDKQPRKK,11720.73190469,11728.51578,,,,,1
4704,HMGN2_HUMAN,P05204,Non-histone chromosomal protein HMG-17,P05204,,MPKRKAEGDAKGDKAKVKDEPQRRSARLSAKPAPPKPEPKPKKAPAKKGEKVPKGKKGKADAGKEGNNPAENGDAKTDQAQKAEGAGDAK,0,89,90,MPKRKAEGDAKGDKAKVKDEPQRRSARLSAKPAPPKPEPKPKKAPAKKGEKVPKGKKGKADAGKEGNNPAENGDAKTDQAQKAEGAGDAK,9387.05719469,9392.66988,,,,,1
5034,COF1_HUMAN,P23528,Cofilin-1,P23528,,MASGVAVSDGVIKVFNDMKVRKSSTPEEVKKRKKAVLFCLSEDKKNIILEEGKEILVGDVGQTVDDPYATFVKMLPDKDCRYALYDATYETKESKKEDLVFIFWAPESAPLKSKMIYASSKDAIKKKLTGIKHELQANCYEEVKDRCTLAEKLGGSAVISLEGKPL,0,165,166,MASGVAVSDGVIKVFNDMKVRKSSTPEEVKKRKKAVLFCLSEDKKNIILEEGKEILVGDVGQTVDDPYATFVKMLPDKDCRYALYDATYETKESKKEDLVFIFWAPESAPLKSKMIYASSKDAIKKKLTGIKHELQANCYEEVKDRCTLAEKLGGSAVISLEGKPL,18490.65742469,18502.49358,,,,,1
6162,SH3L1_HUMAN,O75368,SH3 domain-binding glutamic acid-rich-like protein,O75368,,MVIRVYIASSSGSTAIKKKQQDVLGFLEANKIGFEEKDIAANEENRKWMRENVPENSRPATGYPLPPQIFNESQYRGDYDAFFEARENNAVYAFLGLTAPPGSKEAEVQAKQQA,0,113,114,MVIRVYIASSSGSTAIKKKQQDVLGFLEANKIGFEEKDIAANEENRKWMRENVPENSRPATGYPLPPQIFNESQYRGDYDAFFEARENNAVYAFLGLTAPPGSKEAEVQAKQQA,12766.37809469,12774.25188,,,,,1
7000,TYB4_HUMAN,P62328,Thymosin beta-4,P62328,,MSDKPDMAEIEKFDKSKLKKTETQEKNPLPSKETIEQEKQAGES,0,43,44,MSDKPDMAEIEKFDKSKLKKTETQEKNPLPSKETIEQEKQAGES,5049.51616469,5052.65498,,,,,1
11785,PLCH2_HUMAN,O75038,1-phosphatidylinositol 4;5-bisphosphate phosphodiesterase eta-2,O75038-1,1,MSGPWPSPDSRTKGTVAWLAEVLLWVGGSVVLSSEWQLGPLVERCMGAMQEGMQMVKLRGGSKGLVRFYYLDEHRSCIRWRPSRKNEKAKISIDSIQEVSEGRQSEVFQRYPDGSFDPNCCFSIYHGSHRESLDLVSTSSEVARTWVTGLRYLMAGISDEDSLARRQRTRDQWLKQTFDEADKNGDGSLSIGEVLQLLHKLNVNLPRQRVKQMFREADTDDHQGTLGFEEFCAFYKMMSTRRDLYLLMLTYSNHKDHLDAASLQRFLQVEQKMAGVTLESCQDIIEQFEPCPENKSKGLLGIDGFTNYTRSPAGDIFNPEHHHVHQDMTQPLSHYFITSSHNTYLVGDQLMSQSRVDMYAWVLQAGCRCVEVDCWDGPDGEPIVHHGYTLTSKILFKDVIETINKYAFIKNEYPVILSIENHCSVIQQKKMAQYLTDILGDKLDLSSVSSEDATTLPSPQMLKGKILVKGKKLPANISEDAEEGEVSDEDSADEIDDDCKLLNGDASTNRKRVENTAKRKLDSLIKESKIRDCEDPNNFSVSTLSPSGKLGRKSKAEEDVESGEDAGASRRNGRLVVGSFSRRKKKGSKLKKAASVEEGDEGQDSPGGQSRGATRQKKTMKLSRALSDLVKYTKSVATHDIEMEAASSWQVSSFSETKAHQILQQKPAQYLRFNQQQLSRIYPSSYRVDSSNYNPQPFWNAGCQMVALNYQSEGRMLQLNRAKFSANGGCGYVLKPGCMCQGVFNPNSEDPLPGQLKKQLVLRIISGQQLPKPRDSMLGDRGEIIDPFVEVEIIGLPVDCSREQTRVVDDNGFNPTWEETLVFMVHMPEIALVRFLVWDHDPIGRDFIGQRTLAFSSMMPGYRHVYLEGMEEASIFVHVAVSDISGKVKQALGLKGLFLRGPKPGSLDSHAAGRPPARPSVSQRILRRTASAPTKSQKPGRRGFPELVLGTRDTGSKGVADDVVPPGPGPAPEAPAQEGPGSGSPRDTRPLSTQRPLPPLCSLETIAEEPAPGPGPPPPAAVPTSSSQGRPPYPTGPGANVASPLEDTEEPRDSRPRPCNGEGAGGAYERAPGSQTDGRSQPRTLGHLPVIRRVKSEGQVPTEPLGGWRPLAAPFPAPAVYSDATGSDPLWQRLEPCGHRDSVSSSSSMSSSDTVIDLSLPSLGLGRSRENLAGAHMGRLPPRPHSASAARPDLPPVTKSKSNPNLRATGQRPPIPDELQPRSLAPRMAGLPFRPPWGCLSLVGVQDCPVAAKSKSLGDLTADDFAPSFEGGSRRLSHSLGLPGGTRRVSGPGVRRDTLTEQLRWLTVFQQAGDITSPTSLGPAGEGVAGGPGFVRRSSSRSHSRVRAIASRARQAQERQQRLQGLGRQGPPEEERGTPEGACSVGHEGSVDAPAPSKGALGPASAAAENLVLLRL,0,1415,1416,MSGPWPSPDSRTKGTVAWLAEVLLWVGGSVVLSSEWQLGPLVERCMGAMQEGMQMVKLRGGSKGLVRFYYLDEHRSCIRWRPSRKNEKAKISIDSIQEVSEGRQSEVFQRYPDGSFDPNCCFSIYHGSHRESLDLVSTSSEVARTWVTGLRYLMAGISDEDSLARRQRTRDQWLKQTFDEADKNGDGSLSIGEVLQLLHKLNVNLPRQRVKQMFREADTDDHQGTLGFEEFCAFYKMMSTRRDLYLLMLTYSNHKDHLDAASLQRFLQVEQKMAGVTLESCQDIIEQFEPCPENKSKGLLGIDGFTNYTRSPAGDIFNPEHHHVHQDMTQPLSHYFITSSHNTYLVGDQLMSQSRVDMYAWVLQAGCRCVEVDCWDGPDGEPIVHHGYTLTSKILFKDVIETINKYAFIKNEYPVILSIENHCSVIQQKKMAQYLTDILGDKLDLSSVSSEDATTLPSPQMLKGKILVKGKKLPANISEDAEEGEVSDEDSADEIDDDCKLLNGDASTNRKRVENTAKRKLDSLIKESKIRDCEDPNNFSVSTLSPSGKLGRKSKAEEDVESGEDAGASRRNGRLVVGSFSRRKKKGSKLKKAASVEEGDEGQDSPGGQSRGATRQKKTMKLSRALSDLVKYTKSVATHDIEMEAASSWQVSSFSETKAHQILQQKPAQYLRFNQQQLSRIYPSSYRVDSSNYNPQPFWNAGCQMVALNYQSEGRMLQLNRAKFSANGGCGYVLKPGCMCQGVFNPNSEDPLPGQLKKQLVLRIISGQQLPKPRDSMLGDRGEIIDPFVEVEIIGLPVDCSREQTRVVDDNGFNPTWEETLVFMVHMPEIALVRFLVWDHDPIGRDFIGQRTLAFSSMMPGYRHVYLEGMEEASIFVHVAVSDISGKVKQALGLKGLFLRGPKPGSLDSHAAGRPPARPSVSQRILRRTASAPTKSQKPGRRGFPELVLGTRDTGSKGVADDVVPPGPGPAPEAPAQEGPGSGSPRDTRPLSTQRPLPPLCSLETIAEEPAPGPGPPPPAAVPTSSSQGRPPYPTGPGANVASPLEDTEEPRDSRPRPCNGEGAGGAYERAPGSQTDGRSQPRTLGHLPVIRRVKSEGQVPTEPLGGWRPLAAPFPAPAVYSDATGSDPLWQRLEPCGHRDSVSSSSSMSSSDTVIDLSLPSLGLGRSRENLAGAHMGRLPPRPHSASAARPDLPPVTKSKSNPNLRATGQRPPIPDELQPRSLAPRMAGLPFRPPWGCLSLVGVQDCPVAAKSKSLGDLTADDFAPSFEGGSRRLSHSLGLPGGTRRVSGPGVRRDTLTEQLRWLTVFQQAGDITSPTSLGPAGEGVAGGPGFVRRSSSRSHSRVRAIASRARQAQERQQRLQGLGRQGPPEEERGTPEGACSVGHEGSVDAPAPSKGALGPASAAAENLVLLRL,154571.715264691,154668.306980001,,,,,0
11786,SODC_HUMAN,P00441,Superoxide dismutase [Cu-Zn],P00441,,MATKAVCVLKGDGPVQGIINFEQKESNGPVKVWGSIKGLTEGLHGFHVHEFGDNTAGCTSAGPHFNPLSRKHGGPKDEERHVGDLGNVTADKDGVADVSIEDSVISLSGDHCIIGRTLVVHEKADDLGKGGNEESTKTGNAGSRLACGVIGIAQ,0,153,154,MATKAVCVLKGDGPVQGIINFEQKESNGPVKVWGSIKGLTEGLHGFHVHEFGDNTAGCTSAGPHFNPLSRKHGGPKDEERHVGDLGNVTADKDGVADVSIEDSVISLSGDHCIIGRTLVVHEKADDLGKGGNEESTKTGNAGSRLACGVIGIAQ,15925.90349469,15935.74228,,,,,0
11787,CYTA_HUMAN,P01040,Cystatin-A,P01040,,MIPGGLSEAKPATPEIQEIVDKVKPQLEEKTNETYGKLEAVQYKTQVVAGTNYYIKVRAGDNKYMHLKVFKSLPGQNEDLVLTGYQVDKNKDDELTGF,0,97,98,MIPGGLSEAKPATPEIQEIVDKVKPQLEEKTNETYGKLEAVQYKTQVVAGTNYYIKVRAGDNKYMHLKVFKSLPGQNEDLVLTGYQVDKNKDDELTGF,10999.66222469,11006.49278,,,,,1
11788,SODM_HUMAN,P04179,Superoxide dismutase [Mn]; mitochondrial,P04179-1,1,MLSRAVCGTSRQLAPALGYLGSRQKHSLPDLPYDYGALEPHINAQIMQLHHSKHHAAYVNNLNVTEEKYQEALAKGDVTAQIALQPALKFNGGGHINHSIFWTNLSPNGGGEPKGELLEAIKRDFGSFDKFKEKLTAASVGVQGSGWGWLGFNKERGHLQIAACPNQDPLQGTTGLIPLLGIDVWEHAYYLQYKNVRPDYLKAIWNVINWENVTERYMACKK,0,221,222,MLSRAVCGTSRQLAPALGYLGSRQKHSLPDLPYDYGALEPHINAQIMQLHHSKHHAAYVNNLNVTEEKYQEALAKGDVTAQIALQPALKFNGGGHINHSIFWTNLSPNGGGEPKGELLEAIKRDFGSFDKFKEKLTAASVGVQGSGWGWLGFNKERGHLQIAACPNQDPLQGTTGLIPLLGIDVWEHAYYLQYKNVRPDYLKAIWNVINWENVTERYMACKK,24706.55369469,24722.08898,,,,,0
11789,G3P_HUMAN,P04406,Glyceraldehyde-3-phosphate dehydrogenase,P04406-1,1,MGKVKVGVNGFGRIGRLVTRAAFNSGKVDIVAINDPFIDLNYMVYMFQYDSTHGKFHGTVKAENGKLVINGNPITIFQERDPSKIKWGDAGAEYVVESTGVFTTMEKAGAHLQGGAKRVIISAPSADAPMFVMGVNHEKYDNSLKIISNASCTTNCLAPLAKVIHDNFGIVEGLMTTVHAITATQKTVDGPSGKLWRDGRGALQNIIPASTGAAKAVGKVIPELNGKLTGMAFRVPTANVSVVDLTCRLEKPAKYDDIKKVVKQASEGPLKGILGYTEHQVVSSDFNSDTHSSTFDAGAGIALNDHFVKLISWYDNEFGYSNRVVDLMAHMASKE,0,334,335,MGKVKVGVNGFGRIGRLVTRAAFNSGKVDIVAINDPFIDLNYMVYMFQYDSTHGKFHGTVKAENGKLVINGNPITIFQERDPSKIKWGDAGAEYVVESTGVFTTMEKAGAHLQGGAKRVIISAPSADAPMFVMGVNHEKYDNSLKIISNASCTTNCLAPLAKVIHDNFGIVEGLMTTVHAITATQKTVDGPSGKLWRDGRGALQNIIPASTGAAKAVGKVIPELNGKLTGMAFRVPTANVSVVDLTCRLEKPAKYDDIKKVVKQASEGPLKGILGYTEHQVVSSDFNSDTHSSTFDAGAGIALNDHFVKLISWYDNEFGYSNRVVDLMAHMASKE,36030.39723469,36053.21068,,,,,0
11790,S10A9_HUMAN,P06702,Protein S100-A9,P06702,,MTCKMSQLERNIETIINTFHQYSVKLGHPDTLNQGEFKELVRKDLQNFLKKENKNEKVIEHIMEDLDTNADKQLSFEEFIMLMARLTWASHEKMHEGDEGPGHHHKPGLGEGTP,5,113,109,SQLERNIETIINTFHQYSVKLGHPDTLNQGEFKELVRKDLQNFLKKENKNEKVIEHIMEDLDTNADKQLSFEEFIMLMARLTWASHEKMHEGDEGPGHHHKPGLGEGTP,12681.28579969,12689.22828,,PSI-MOD:394@0,,,0
11791,S10A9_HUMAN,P06702,Protein S100-A9,P06702,,MTCKMSQLERNIETIINTFHQYSVKLGHPDTLNQGEFKELVRKDLQNFLKKENKNEKVIEHIMEDLDTNADKQLSFEEFIMLMARLTWASHEKMHEGDEGPGHHHKPGLGEGTP,1,113,113,TCKMSQLERNIETIINTFHQYSVKLGHPDTLNQGEFKELVRKDLQNFLKKENKNEKVIEHIMEDLDTNADKQLSFEEFIMLMARLTWASHEKMHEGDEGPGHHHKPGLGEGTP,13144.47811969,13152.83888,,PSI-MOD:394@0,,,0
11792,S10A9_HUMAN,P06702,Protein S100-A9,P06702,,MTCKMSQLERNIETIINTFHQYSVKLGHPDTLNQGEFKELVRKDLQNFLKKENKNEKVIEHIMEDLDTNADKQLSFEEFIMLMARLTWASHEKMHEGDEGPGHHHKPGLGEGTP,0,113,114,MTCKMSQLERNIETIINTFHQYSVKLGHPDTLNQGEFKELVRKDLQNFLKKENKNEKVIEHIMEDLDTNADKQLSFEEFIMLMARLTWASHEKMHEGDEGPGHHHKPGLGEGTP,13233.50804469,13241.99148,,,,,0
11793,S10A6_HUMAN,P06703,Protein S100-A6,P06703,,MACPLDQAIGLLVAIFHKYSGREGDKHTLSKKELKELIQKELTIGSKLQDAEIARLMEDLDRNKDQEVNFQEYVTFLGALALIYNEALKG,0,89,90,MACPLDQAIGLLVAIFHKYSGREGDKHTLSKKELKELIQKELTIGSKLQDAEIARLMEDLDRNKDQEVNFQEYVTFLGALALIYNEALKG,10173.34234469,10179.73888,,,,,0
11794,G6PI_HUMAN,P06744,Glucose-6-phosphate isomerase,P06744-1,1,MAALTRDPQFQKLQQWYREHRSELNLRRLFDANKDRFNHFSLTLNTNHGHILVDYSKNLVTEDVMRMLVDLAKSRGVEAARERMFNGEKINYTEGRAVLHVALRNRSNTPILVDGKDVMPEVNKVLDKMKSFCQRVRSGDWKGYTGKTITDVINIGIGGSDLGPLMVTEALKPYSSGGPRVWYVSNIDGTHIAKTLAQLNPESSLFIIASKTFTTQETITNAETAKEWFLQAAKDPSAVAKHFVALSTNTTKVKEFGIDPQNMFEFWDWVGGRYSLWSAIGLSIALHVGFDNFEQLLSGAHWMDQHFRTTPLEKNAPVLLALLGIWYINCFGCETHAMLPYDQYLHRFAAYFQQGDMESNGKYITKSGTRVDHQTGPIVWGEPGTNGQHAFYQLIHQGTKMIPCDFLIPVQTQHPIRKGLHHKILLANFLAQTEALMRGKSTEEARKELQAAGKSPEDLERLLPHKVFEGNRPTNSIVFTKLTPFMLGALVAMYEHKIFVQGIIWDINSFDQWGVELGKQLAKKIEPELDGSAQVTSHDASTNGLINFIKQQREARVQ,0,557,558,MAALTRDPQFQKLQQWYREHRSELNLRRLFDANKDRFNHFSLTLNTNHGHILVDYSKNLVTEDVMRMLVDLAKSRGVEAARERMFNGEKINYTEGRAVLHVALRNRSNTPILVDGKDVMPEVNKVLDKMKSFCQRVRSGDWKGYTGKTITDVINIGIGGSDLGPLMVTEALKPYSSGGPRVWYVSNIDGTHIAKTLAQLNPESSLFIIASKTFTTQETITNAETAKEWFLQAAKDPSAVAKHFVALSTNTTKVKEFGIDPQNMFEFWDWVGGRYSLWSAIGLSIALHVGFDNFEQLLSGAHWMDQHFRTTPLEKNAPVLLALLGIWYINCFGCETHAMLPYDQYLHRFAAYFQQGDMESNGKYITKSGTRVDHQTGPIVWGEPGTNGQHAFYQLIHQGTKMIPCDFLIPVQTQHPIRKGLHHKILLANFLAQTEALMRGKSTEEARKELQAAGKSPEDLERLLPHKVFEGNRPTNSIVFTKLTPFMLGALVAMYEHKIFVQGIIWDINSFDQWGVELGKQLAKKIEPELDGSAQVTSHDASTNGLINFIKQQREARVQ,63107.2425246901,63147.1266799998,,,,,1
11795,ACBP_HUMAN,P07108,Acyl-CoA-binding protein,P07108-1,1,MSQAEFEKAAEEVRHLKTKPSDEEMLFIYGHYKQATVGDINTERPGMLDFTGKAKWDAWNELKGTSKEDAMKAYINKVEELKKKYGI,0,86,87,MSQAEFEKAAEEVRHLKTKPSDEEMLFIYGHYKQATVGDINTERPGMLDFTGKAKWDAWNELKGTSKEDAMKAYINKVEELKKKYGI,10038.02077469,10044.42038,,,,,1
11796,ACBP_HUMAN,P07108,Acyl-CoA-binding protein,P07108-1,1,MSQAEFEKAAEEVRHLKTKPSDEEMLFIYGHYKQATVGDINTERPGMLDFTGKAKWDAWNELKGTSKEDAMKAYINKVEELKKKYGI,0,86,87,MSQAEFEKAAEEVRHLKTKPSDEEMLFIYGHYKQATVGDINTERPGMLDFTGKAKWDAWNELKGTSKEDAMKAYINKVEELKKKYGI,10038.02077469,10044.42038,,PSI-MOD:29@70,,,0
11797,PROF1_HUMAN,P07737,Profilin-1,P07737,,MAGWNAYIDNLMADGTCQDAAIVGYKDSPSVWAAVPGKTFVNITPAEVGVLVGKDRSSFYVNGLTLGGQKCSVIRDSLLQDGEFSMDLRTKSTGGAPTFNVTVTKTDKTLVLLMGKEGVHGGLINKKCYEMASHLRRSQY,0,139,140,MAGWNAYIDNLMADGTCQDAAIVGYKDSPSVWAAVPGKTFVNITPAEVGVLVGKDRSSFYVNGLTLGGQKCSVIRDSLLQDGEFSMDLRTKSTGGAPTFNVTVTKTDKTLVLLMGKEGVHGGLINKKCYEMASHLRRSQY,15044.55581469,15054.23008,,,,,0
11798,H2A1_HUMAN,P0C0S8,Histone H2A type 1,P0C0S8,,MSGRGKQGGKARAKAKTRSSRAGLQFPVGRVHRLLRKGNYAERVGAGAPVYLAAVLEYLTAEILELAGNAARDNKKTRIIPRHLQLAIRNDEELNKLLGKVTIAQGGVLPNIQAVLLPKKTESHHKAKGK,0,129,130,MSGRGKQGGKARAKAKTRSSRAGLQFPVGRVHRLLRKGNYAERVGAGAPVYLAAVLEYLTAEILELAGNAARDNKKTRIIPRHLQLAIRNDEELNKLLGKVTIAQGGVLPNIQAVLLPKKTESHHKAKGK,14082.94857469,14091.48188,,,,,1
11799,H14_HUMAN,P10412,Histone H1.4,P10412,,MSETAPAAPAAPAPAEKTPVKKKARKSAGAAKRKASGPPVSELITKAVAASKERSGVSLAALKKALAAAGYDVEKNNSRIKLGLKSLVSKGTLVQTKGTGASGSFKLNKKAASGEAKPKAKKAGAAKAKKPAGAAKKPKKATGAATPKKSAKKTPKKAKKPAAAAGAKKAKSPKKAKAAKPKKAPKSPAKAKAVKPKAAKPKTAKPKAAKPKKAAAKKK,0,218,219,MSETAPAAPAAPAPAEKTPVKKKARKSAGAAKRKASGPPVSELITKAVAASKERSGVSLAALKKALAAAGYDVEKNNSRIKLGLKSLVSKGTLVQTKGTGASGSFKLNKKAASGEAKPKAKKAGAAKAKKPAGAAKKPKKATGAATPKKSAKKTPKKAKKPAAAAGAKKAKSPKKAKAAKPKKAPKSPAKAKAVKPKAAKPKTAKPKAAKPKKAAAKKK,21852.00371469,21865.27128,,,,,0
11800,PERE_HUMAN,P11678,Eosinophil peroxidase,P11678,,MHLLPALAGVLATLVLAQPCEGTDPASPGAVETSVLRDCIAEAKLLVDAAYNWTQKSIKQRLRSGSASPMDLLSYFKQPVAATRTVVRAADYMHVALGLLEEKLQPQRSGPFNVTDVLTEPQLRLLSQASGCALRDQAERCSDKYRTITGRCNNKRRPLLGASNQALARWLPAEYEDGLSLPFGWTPSRRRNGFLLPLVRAVSNQIVRFPNERLTSDRGRALMFMQWGQFIDHDLDFSPESPARVAFTAGVDCERTCAQLPPCFPIKIPPNDPRIKNQRDCIPFFRSAPSCPQNKNRVRNQINALTSFVDASMVYGSEVSLSLRLRNRTNYLGLLAINQRFQDNGRALLPFDNLHDDPCLLTNRSARIPCFLAGDTRSTETPKLAAMHTLFMREHNRLATELRRLNPRWNGDKLYNEARKIMGAMVQIITYRDFLPLVLGKARARRTLGHYRGYCSNVDPRVANVFTLAFRFGHTMLQPFMFRLDSQYRASAPNSHVPLSSAFFASWRIVYEGGIDPILRGLMATPAKLNRQDAMLVDELRDRLFRQVRRIGLDLAALNMQRSRDHGLPGYNAWRRFCGLSQPRNLAQLSRVLKNQDLARKFLNLYGTPDNIDIWIGAIAEPLLPGARVGPLLACLFENQFRRARDGDRFWWQKRGVFTKRQRKALSRISLSRIICDNTGITTVSRDIFRANIYPRGFVNCSRIPRLNLSAWRGT,0,714,715,MHLLPALAGVLATLVLAQPCEGTDPASPGAVETSVLRDCIAEAKLLVDAAYNWTQKSIKQRLRSGSASPMDLLSYFKQPVAATRTVVRAADYMHVALGLLEEKLQPQRSGPFNVTDVLTEPQLRLLSQASGCALRDQAERCSDKYRTITGRCNNKRRPLLGASNQALARWLPAEYEDGLSLPFGWTPSRRRNGFLLPLVRAVSNQIVRFPNERLTSDRGRALMFMQWGQFIDHDLDFSPESPARVAFTAGVDCERTCAQLPPCFPIKIPPNDPRIKNQRDCIPFFRSAPSCPQNKNRVRNQINALTSFVDASMVYGSEVSLSLRLRNRTNYLGLLAINQRFQDNGRALLPFDNLHDDPCLLTNRSARIPCFLAGDTRSTETPKLAAMHTLFMREHNRLATELRRLNPRWNGDKLYNEARKIMGAMVQIITYRDFLPLVLGKARARRTLGHYRGYCSNVDPRVANVFTLAFRFGHTMLQPFMFRLDSQYRASAPNSHVPLSSAFFASWRIVYEGGIDPILRGLMATPAKLNRQDAMLVDELRDRLFRQVRRIGLDLAALNMQRSRDHGLPGYNAWRRFCGLSQPRNLAQLSRVLKNQDLARKFLNLYGTPDNIDIWIGAIAEPLLPGARVGPLLACLFENQFRRARDGDRFWWQKRGVFTKRQRKALSRISLSRIICDNTGITTVSRDIFRANIYPRGFVNCSRIPRLNLSAWRGT,80989.1321646903,81040.4729800001,,,,,0
11801,H15_HUMAN,P16401,Histone H1.5,P16401,,MSETAPAETATPAPVEKSPAKKKATKKAAGAGAAKRKATGPPVSELITKAVAASKERNGLSLAALKKALAAGGYDVEKNNSRIKLGLKSLVSKGTLVQTKGTGASGSFKLNKKAASGEAKPKAKKAGAAKAKKPAGATPKKAKKAAGAKKAVKKTPKKAKKPAAAGVKKVAKSPKKAKAAAKPKKATKSPAKPKAVKPKAAKPKAAKPKAAKPKAAKAKKAAAKKK,0,225,226,MSETAPAETATPAPVEKSPAKKKATKKAAGAGAAKRKATGPPVSELITKAVAASKERNGLSLAALKKALAAGGYDVEKNNSRIKLGLKSLVSKGTLVQTKGTGASGSFKLNKKAASGEAKPKAKKAGAAKAKKPAGATPKKAKKAAGAKKAVKKTPKKAKKPAAAGVKKVAKSPKKAKAAAKPKKATKSPAKPKAVKPKAAKPKAAKPKAAKPKAAKAKKAAAKKK,22566.46766469,22580.17478,,,,,0
11802,H12_HUMAN,P16403,Histone H1.2,P16403,,MSETAPAAPAAAPPAEKAPVKKKAAKKAGGTPRKASGPPVSELITKAVAASKERSGVSLAALKKALAAAGYDVEKNNSRIKLGLKSLVSKGTLVQTKGTGASGSFKLNKKAASGEAKPKVKKAGGTKPKKPVGAAKKPKKAAGGATPKKSAKKTPKKAKKPAAATVTKKVAKSPKKAKVAKPKKAAKSAAKAVKPKAAKPKVVKPKKAAPKKK,0,212,213,MSETAPAAPAAAPPAEKAPVKKKAAKKAGGTPRKASGPPVSELITKAVAASKERSGVSLAALKKALAAAGYDVEKNNSRIKLGLKSLVSKGTLVQTKGTGASGSFKLNKKAASGEAKPKVKKAGGTKPKKPVGAAKKPKKAAGGATPKKSAKKTPKKAKKPAAATVTKKVAKSPKKAKVAKPKKAAKSAAKAVKPKAAKPKVVKPKKAAPKKK,21351.74695469,21364.75358,,,,,1
11803,COR1A_HUMAN,P31146,Coronin-1A,P31146,,MSRQVVRSSKFRHVFGQPAKADQCYEDVRVSQTTWDSGFCAVNPKFVALICEASGGGAFLVLPLGKTGRVDKNAPTVCGHTAPVLDIAWCPHNDNVIASGSEDCTVMVWEIPDGGLMLPLREPVVTLEGHTKRVGIVAWHTTAQNVLLSAGCDNVIMVWDVGTGAAMLTLGPEVHPDTIYSVDWSRDGGLICTSCRDKRVRIIEPRKGTVVAEKDRPHEGTRPVRAVFVSEGKILTTGFSRMSERQVALWDTKHLEEPLSLQELDTSSGVLLPFFDPDTNIVYLCGKGDSSIRYFEITSEAPFLHYLSMFSSKESQRGMGYMPKRGLEVNKCEIARFYKLHERRCEPIAMTVPRKSDLFQEDLYPPTAGPDPALTAEEWLGGRDAGPLLISLKDGYVPPKSRELRVNRGLDTGRRRAAPEASGTPSSDAVSRLEEEMRKLQATVQELQKRLDRLEETVQAK,0,460,461,MSRQVVRSSKFRHVFGQPAKADQCYEDVRVSQTTWDSGFCAVNPKFVALICEASGGGAFLVLPLGKTGRVDKNAPTVCGHTAPVLDIAWCPHNDNVIASGSEDCTVMVWEIPDGGLMLPLREPVVTLEGHTKRVGIVAWHTTAQNVLLSAGCDNVIMVWDVGTGAAMLTLGPEVHPDTIYSVDWSRDGGLICTSCRDKRVRIIEPRKGTVVAEKDRPHEGTRPVRAVFVSEGKILTTGFSRMSERQVALWDTKHLEEPLSLQELDTSSGVLLPFFDPDTNIVYLCGKGDSSIRYFEITSEAPFLHYLSMFSSKESQRGMGYMPKRGLEVNKCEIARFYKLHERRCEPIAMTVPRKSDLFQEDLYPPTAGPDPALTAEEWLGGRDAGPLLISLKDGYVPPKSRELRVNRGLDTGRRRAAPEASGTPSSDAVSRLEEEMRKLQATVQELQKRLDRLEETVQAK,50993.7999846901,51026.25438,,,,,0
11804,MYH9_HUMAN,P35579,Myosin-9,P35579-1,1,MAQQAADKYLYVDKNFINNPLAQADWAAKKLVWVPSDKSGFEPASLKEEVGEEAIVELVENGKKVKVNKDDIQKMNPPKFSKVEDMAELTCLNEASVLHNLKERYYSGLIYTYSGLFCVVINPYKNLPIYSEEIVEMYKGKKRHEMPPHIYAITDTAYRSMMQDREDQSILCTGESGAGKTENTKKVIQYLAYVASSHKSKKDQGELERQLLQANPILEAFGNAKTVKNDNSSRFGKFIRINFDVNGYIVGANIETYLLEKSRAIRQAKEERTFHIFYYLLSGAGEHLKTDLLLEPYNKYRFLSNGHVTIPGQQDKDMFQETMEAMRIMGIPEEEQMGLLRVISGVLQLGNIVFKKERNTDQASMPDNTAAQKVSHLLGINVTDFTRGILTPRIKVGRDYVQKAQTKEQADFAIEALAKATYERMFRWLVLRINKALDKTKRQGASFIGILDIAGFEIFDLNSFEQLCINYTNEKLQQLFNHTMFILEQEEYQREGIEWNFIDFGLDLQPCIDLIEKPAGPPGILALLDEECWFPKATDKSFVEKVMQEQGTHPKFQKPKQLKDKADFCIIHYAGKVDYKADEWLMKNMDPLNDNIATLLHQSSDKFVSELWKDVDRIIGLDQVAGMSETALPGAFKTRKGMFRTVGQLYKEQLAKLMATLRNTNPNFVRCIIPNHEKKAGKLDPHLVLDQLRCNGVLEGIRICRQGFPNRVVFQEFRQRYEILTPNSIPKGFMDGKQACVLMIKALELDSNLYRIGQSKVFFRAGVLAHLEEERDLKITDVIIGFQACCRGYLARKAFAKRQQQLTAMKVLQRNCAAYLKLRNWQWWRLFTKVKPLLQVSRQEEEMMAKEEELVKVREKQLAAENRLTEMETLQSQLMAEKLQLQEQLQAETELCAEAEELRARLTAKKQELEEICHDLEARVEEEEERCQHLQAEKKKMQQNIQELEEQLEEEESARQKLQLEKVTTEAKLKKLEEEQIILEDQNCKLAKEKKLLEDRIAEFTTNLTEEEEKSKSLAKLKNKHEAMITDLEERLRREEKQRQELEKTRRKLEGDSTDLSDQIAELQAQIAELKMQLAKKEEELQAALARVEEEAAQKNMALKKIRELESQISELQEDLESERASRNKAEKQKRDLGEELEALKTELEDTLDSTAAQQELRSKREQEVNILKKTLEEEAKTHEAQIQEMRQKHSQAVEELAEQLEQTKRVKANLEKAKQTLENERGELANEVKVLLQGKGDSEHKRKKVEAQLQELQVKFNEGERVRTELADKVTKLQVELDNVTGLLSQSDSKSSKLTKDFSALESQLQDTQELLQEENRQKLSLSTKLKQVEDEKNSFREQLEEEEEAKHNLEKQIATLHAQVADMKKKMEDSVGCLETAEEVKRKLQKDLEGLSQRHEEKVAAYDKLEKTKTRLQQELDDLLVDLDHQRQSACNLEKKQKKFDQLLAEEKTISAKYAEERDRAEAEAREKETKALSLARALEEAMEQKAELERLNKQFRTEMEDLMSSKDDVGKSVHELEKSKRALEQQVEEMKTQLEELEDELQATEDAKLRLEVNLQAMKAQFERDLQGRDEQSEEKKKQLVRQVREMEAELEDERKQRSMAVAARKKLEMDLKDLEAHIDSANKNRDEAIKQLRKLQAQMKDCMRELDDTRASREEILAQAKENEKKLKSMEAEMIQLQEELAAAERAKRQAQQERDELADEIANSSGKGALALEEKRRLEARIAQLEEELEEEQGNTELINDRLKKANLQIDQINTDLNLERSHAQKNENARQQLERQNKELKVKLQEMEGTVKSKYKASITALEAKIAQLEEQLDNETKERQAACKQVRRTEKKLKDVLLQVDDERRNAEQYKDQADKASTRLKQLKRQLEEAEEEAQRANASRRKLQRELEDATETADAMNREVSSLKNKLRRGDLPFVVPRRMARKGAGDGSDEEVDGKADGAEAKPAE,0,1959,1960,MAQQAADKYLYVDKNFINNPLAQADWAAKKLVWVPSDKSGFEPASLKEEVGEEAIVELVENGKKVKVNKDDIQKMNPPKFSKVEDMAELTCLNEASVLHNLKERYYSGLIYTYSGLFCVVINPYKNLPIYSEEIVEMYKGKKRHEMPPHIYAITDTAYRSMMQDREDQSILCTGESGAGKTENTKKVIQYLAYVASSHKSKKDQGELERQLLQANPILEAFGNAKTVKNDNSSRFGKFIRINFDVNGYIVGANIETYLLEKSRAIRQAKEERTFHIFYYLLSGAGEHLKTDLLLEPYNKYRFLSNGHVTIPGQQDKDMFQETMEAMRIMGIPEEEQMGLLRVISGVLQLGNIVFKKERNTDQASMPDNTAAQKVSHLLGINVTDFTRGILTPRIKVGRDYVQKAQTKEQADFAIEALAKATYERMFRWLVLRINKALDKTKRQGASFIGILDIAGFEIFDLNSFEQLCINYTNEKLQQLFNHTMFILEQEEYQREGIEWNFIDFGLDLQPCIDLIEKPAGPPGILALLDEECWFPKATDKSFVEKVMQEQGTHPKFQKPKQLKDKADFCIIHYAGKVDYKADEWLMKNMDPLNDNIATLLHQSSDKFVSELWKDVDRIIGLDQVAGMSETALPGAFKTRKGMFRTVGQLYKEQLAKLMATLRNTNPNFVRCIIPNHEKKAGKLDPHLVLDQLRCNGVLEGIRICRQGFPNRVVFQEFRQRYEILTPNSIPKGFMDGKQACVLMIKALELDSNLYRIGQSKVFFRAGVLAHLEEERDLKITDVIIGFQACCRGYLARKAFAKRQQQLTAMKVLQRNCAAYLKLRNWQWWRLFTKVKPLLQVSRQEEEMMAKEEELVKVREKQLAAENRLTEMETLQSQLMAEKLQLQEQLQAETELCAEAEELRARLTAKKQELEEICHDLEARVEEEEERCQHLQAEKKKMQQNIQELEEQLEEEESARQKLQLEKVTTEAKLKKLEEEQIILEDQNCKLAKEKKLLEDRIAEFTTNLTEEEEKSKSLAKLKNKHEAMITDLEERLRREEKQRQELEKTRRKLEGDSTDLSDQIAELQAQIAELKMQLAKKEEELQAALARVEEEAAQKNMALKKIRELESQISELQEDLESERASRNKAEKQKRDLGEELEALKTELEDTLDSTAAQQELRSKREQEVNILKKTLEEEAKTHEAQIQEMRQKHSQAVEELAEQLEQTKRVKANLEKAKQTLENERGELANEVKVLLQGKGDSEHKRKKVEAQLQELQVKFNEGERVRTELADKVTKLQVELDNVTGLLSQSDSKSSKLTKDFSALESQLQDTQELLQEENRQKLSLSTKLKQVEDEKNSFREQLEEEEEAKHNLEKQIATLHAQVADMKKKMEDSVGCLETAEEVKRKLQKDLEGLSQRHEEKVAAYDKLEKTKTRLQQELDDLLVDLDHQRQSACNLEKKQKKFDQLLAEEKTISAKYAEERDRAEAEAREKETKALSLARALEEAMEQKAELERLNKQFRTEMEDLMSSKDDVGKSVHELEKSKRALEQQVEEMKTQLEELEDELQATEDAKLRLEVNLQAMKAQFERDLQGRDEQSEEKKKQLVRQVREMEAELEDERKQRSMAVAARKKLEMDLKDLEAHIDSANKNRDEAIKQLRKLQAQMKDCMRELDDTRASREEILAQAKENEKKLKSMEAEMIQLQEELAAAERAKRQAQQERDELADEIANSSGKGALALEEKRRLEARIAQLEEELEEEQGNTELINDRLKKANLQIDQINTDLNLERSHAQKNENARQQLERQNKELKVKLQEMEGTVKSKYKASITALEAKIAQLEEQLDNETKERQAACKQVRRTEKKLKDVLLQVDDERRNAEQYKDQADKASTRLKQLKRQLEEAEEEAQRANASRRKLQRELEDATETADAMNREVSSLKNKLRRGDLPFVVPRRMARKGAGDGSDEEVDGKADGAEAKPAE,226391.587774689,226532.244880002,,,,,0
11805,GDIR2_HUMAN,P52566,Rho GDP-dissociation inhibitor 2,P52566,,MTEKAPEPHVEEDDDDELDSKLNYKPPPQKSLKELQEMDKDDESLIKYKKTLLGDGPVVTDPKAPNVVVTRLTLVCESAPGPITMDLTGDLEALKKETIVLKEGSEYRVKIHFKVNRDIVSGLKYVQHTYRTGVKVDKATFMVGSYGPRPEEYEFLTPVEEAPKGMLARGTYHNKSFFTDDDKQDHLSWEWNLSIKKEWTE,0,200,201,MTEKAPEPHVEEDDDDELDSKLNYKPPPQKSLKELQEMDKDDESLIKYKKTLLGDGPVVTDPKAPNVVVTRLTLVCESAPGPITMDLTGDLEALKKETIVLKEGSEYRVKIHFKVNRDIVSGLKYVQHTYRTGVKVDKATFMVGSYGPRPEEYEFLTPVEEAPKGMLARGTYHNKSFFTDDDKQDHLSWEWNLSIKKEWTE,22973.60436469,22988.00658,,,,,0
11806,ARPC4_HUMAN,P59998,Actin-related protein 2/3 complex subunit 4,P59998-1,1,MTATLRPYLSAVRATLQAALCLENFSSQVVERHNKPEVEVRSSKELLLQPVTISRNEKEKVLIEGSINSVRVSIAVKQADEIEKILCHKFMRFMMMRAENFFILRRKPVEGYDISFLITNFHTEQMYKHKLVDFVIHFMEEIDKEISEMKLSVNARARIVAEEFLKNF,0,167,168,MTATLRPYLSAVRATLQAALCLENFSSQVVERHNKPEVEVRSSKELLLQPVTISRNEKEKVLIEGSINSVRVSIAVKQADEIEKILCHKFMRFMMMRAENFFILRRKPVEGYDISFLITNFHTEQMYKHKLVDFVIHFMEEIDKEISEMKLSVNARARIVAEEFLKNF,19654.30346469,19667.01448,,,,,0