PFR,UniProt Id,Entry Accession,Entry Description,Isoform Accession,Isoform Description,Isoform Sequence,Start,End,Length,Proteoform Sequence,Monoisotopic Mass,Average Mass,Sequence Modifications,PTMs,N-Terminal,C-Terminal,Star
8640,CH10_MOUSE,Q64433,10 kDa heat shock protein; mitochondrial,Q64433,,MAGQAFRKFLPLFDRVLVERSAAETVTKGGIMLPEKSQGKVLQATVVAVGSGGKGKSGEIEPVSVKVGDKVLLPEYGGTKVVLDDKDYFLFRDSDILGKYVD,1,101,101,AGQAFRKFLPLFDRVLVERSAAETVTKGGIMLPEKSQGKVLQATVVAVGSGGKGKSGEIEPVSVKVGDKVLLPEYGGTKVVLDDKDYFLFRDSDILGKYVD,10866.83555969,10873.55038,,RESID:41@0,,,1
8641,VATL_MOUSE,P63082,V-type proton ATPase 16 kDa proteolipid subunit,P63082,,MADIKNNPEYSSFFGVMGASSAMVFSAMGAAYGTAKSGTGIAAMSVMRPELIMKSIIPVVMAGIIAIYGLVVAVLIANSLTDGITLYRSFLQLGAGLSVGLSGLAAGFAIGIVGDAGVRGTAQQPRLFVGMILILIFAEVLGLYGLIVALILSTK,1,154,154,ADIKNNPEYSSFFGVMGASSAMVFSAMGAAYGTAKSGTGIAAMSVMRPELIMKSIIPVVMAGIIAIYGLVVAVLIANSLTDGITLYRSFLQLGAGLSVGLSGLAAGFAIGIVGDAGVRGTAQQPRLFVGMILILIFAEVLGLYGLIVALILSTK,15708.48128969,15718.76858,,RESID:41@0,,,1
8642,VMA21_MOUSE,Q78T54,Vacuolar ATPase assembly integral membrane protein Vma21 {ECO:0000255|HAMAP-Rule:MF_03058},Q78T54-1,1,MERLDKAALNALQPPEFRNENSLAATLKTLLFFTALMITVPIGLYFTTKAYIFEGALGMSNRDSYFYAAIVAVVAVHVVLALFVYVAWNEGSRQWREGKQD,0,100,101,MERLDKAALNALQPPEFRNENSLAATLKTLLFFTALMITVPIGLYFTTKAYIFEGALGMSNRDSYFYAAIVAVVAVHVVLALFVYVAWNEGSRQWREGKQD,11399.92775969,11407.22058,,RESID:49@0,,,1
8643,ATOX1_MOUSE,O08997,Copper transport protein ATOX1,O08997,,MPKHEFSVDMTCEGCAEAVSRVLNKLGGVEFNIDLPNKKVCIDSEHSSDTLLATLNKTGKAVSYLGPK,1,67,67,PKHEFSVDMTCEGCAEAVSRVLNKLGGVEFNIDLPNKKVCIDSEHSSDTLLATLNKTGKAVSYLGPK,7202.61877469,7207.23358,,,,,1
8644,Q0VGU2_MOUSE,Q0VGU2,SubName: Full=Prothymosin alpha {ECO:0000313|EMBL:AAH85171.1};,Q0VGU2,,MSDAAVDTSSEITTKDLKEKKEVVEEAENGRDAPANGNAQNEENGEQEADNEVDEEEEEGGEEEEEEEEGDGEEEDGDEDEEAEAPTGKRVAEDDEDDDVDTKKQKTEEDD,1,110,110,SDAAVDTSSEITTKDLKEKKEVVEEAENGRDAPANGNAQNEENGEQEADNEVDEEEEEGGEEEEEEEEGDGEEEDGDEDEEAEAPTGKRVAEDDEDDDVDTKKQKTEEDD,12158.02242969,12164.94338,,RESID:51@0,,,1
8645,HMGN1_MOUSE,P18608,Non-histone chromosomal protein HMG-14,P18608,,MPKRKVSADGAAKAEPKRRSARLSAKPAPAKVDAKPKKAAGKDKASDKKVQIKGKRGAKGKQADVADQQTTELPAENGETENQSPASEEEKEAKSD,1,95,95,PKRKVSADGAAKAEPKRRSARLSAKPAPAKVDAKPKKAAGKDKASDKKVQIKGKRGAKGKQADVADQQTTELPAENGETENQSPASEEEKEAKSD,10015.33013469,10021.19948,,,,,1
8646,Q5SX50_MOUSE,Q5SX50,Profilin {ECO:0000256|RuleBase:RU003909},Q5SX50,,MAGWNAYIDSLMADGTCQDAAIVGYKDSPSVWAAVPGKTFVSITPAEVGVLVGKDRSSFFVNGLTLGGQKCSVIRDSLLQDGEFTMDLRTKSTGGAPTFNVTVTMTAKTLVLLMGKEGVHGGLINKKCYEMASHLRRSQY,1,139,139,AGWNAYIDSLMADGTCQDAAIVGYKDSPSVWAAVPGKTFVSITPAEVGVLVGKDRSSFFVNGLTLGGQKCSVIRDSLLQDGEFTMDLRTKSTGGAPTFNVTVTMTAKTLVLLMGKEGVHGGLINKKCYEMASHLRRSQY,14858.48051969,14868.06248,,RESID:41@0,,,1
8647,GSTP1_MOUSE,P19157,Glutathione S-transferase P 1,P19157,,MPPYTIVYFPVRGRCEAMRMLLADQGQSWKEEVVTIDTWMQGLLKPTCLYGQLPKFEDGDLTLYQSNAILRHLGRSLGLYGKNQREAAQMDMVNDGVEDLRGKYVTLIYTNYENGKNDYVKALPGHLKPFETLLSQNQGGKAFIVGDQISFADYNLLDLLLIHQVLAPGCLDNFPLLSAYVARLSARPKIKAFLSSPEHVNRPINGNGKQ,1,209,209,PPYTIVYFPVRGRCEAMRMLLADQGQSWKEEVVTIDTWMQGLLKPTCLYGQLPKFEDGDLTLYQSNAILRHLGRSLGLYGKNQREAAQMDMVNDGVEDLRGKYVTLIYTNYENGKNDYVKALPGHLKPFETLLSQNQGGKAFIVGDQISFADYNLLDLLLIHQVLAPGCLDNFPLLSAYVARLSARPKIKAFLSSPEHVNRPINGNGKQ,23463.07241469,23477.99058,,,,,1
8648,COX6C_MOUSE,Q9CPQ1,Cytochrome c oxidase subunit 6C,Q9CPQ1,,MSSGALLPKPQMRGLLAKRLRVHIAGAFIVALGVAAAYKFGVAEPRKKAYAEFYRNYDSMKDFEEMRKAGIFQSAK,1,75,75,SSGALLPKPQMRGLLAKRLRVHIAGAFIVALGVAAAYKFGVAEPRKKAYAEFYRNYDSMKDFEEMRKAGIFQSAK,8374.47531969,8379.84708,,RESID:51@0,,,1
8649,THIO_MOUSE,P10639,Thioredoxin,P10639,,MVKLIESKEAFQEALAAAGDKLVVVDFSATWCGPCKMIKPFFHSLCDKYSNVVFLEVDVDDCQDVAADCEVKCMPTFQFYKKGQKVGEFSGANKEKLEASITEYA,1,104,104,VKLIESKEAFQEALAAAGDKLVVVDFSATWCGPCKMIKPFFHSLCDKYSNVVFLEVDVDDCQDVAADCEVKCMPTFQFYKKGQKVGEFSGANKEKLEASITEYA,11536.59876469,11544.25038,,,,,1
8650,PRDX1_MOUSE,P35700,Peroxiredoxin-1,P35700,,MSSGNAKIGYPAPNFKATAVMPDGQFKDISLSEYKGKYVVFFFYPLDFTFVCPTEIIAFSDRADEFKKLNCQVIGASVDSHFCHLAWINTPKKQGGLGPMNIPLISDPKRTIAQDYGVLKADEGISFRGLFIIDDKGILRQITINDLPVGRSVDEIIRLVQAFQFTDKHGEVCPAGWKPGSDTIKPDVNKSKEYFSKQK,1,198,198,SSGNAKIGYPAPNFKATAVMPDGQFKDISLSEYKGKYVVFFFYPLDFTFVCPTEIIAFSDRADEFKKLNCQVIGASVDSHFCHLAWINTPKKQGGLGPMNIPLISDPKRTIAQDYGVLKADEGISFRGLFIIDDKGILRQITINDLPVGRSVDEIIRLVQAFQFTDKHGEVCPAGWKPGSDTIKPDVNKSKEYFSKQK,22153.28695069,22167.32588,,RESID:51@0|RESID:38@88,,,1
8651,PRDX1_MOUSE,P35700,Peroxiredoxin-1,P35700,,MSSGNAKIGYPAPNFKATAVMPDGQFKDISLSEYKGKYVVFFFYPLDFTFVCPTEIIAFSDRADEFKKLNCQVIGASVDSHFCHLAWINTPKKQGGLGPMNIPLISDPKRTIAQDYGVLKADEGISFRGLFIIDDKGILRQITINDLPVGRSVDEIIRLVQAFQFTDKHGEVCPAGWKPGSDTIKPDVNKSKEYFSKQK,1,198,198,SSGNAKIGYPAPNFKATAVMPDGQFKDISLSEYKGKYVVFFFYPLDFTFVCPTEIIAFSDRADEFKKLNCQVIGASVDSHFCHLAWINTPKKQGGLGPMNIPLISDPKRTIAQDYGVLKADEGISFRGLFIIDDKGILRQITINDLPVGRSVDEIIRLVQAFQFTDKHGEVCPAGWKPGSDTIKPDVNKSKEYFSKQK,22073.32061969,22087.34588,,RESID:51@0,,,1
8652,ACBP_MOUSE,P31786,Acyl-CoA-binding protein,P31786,,MSQAEFDKAAEEVKRLKTQPTDEEMLFIYSHFKQATVGDVNTDRPGLLDLKGKAKWDSWNKLKGTSKESAMKTYVEKVDELKKKYGI,1,86,86,SQAEFDKAAEEVKRLKTQPTDEEMLFIYSHFKQATVGDVNTDRPGLLDLKGKAKWDSWNKLKGTSKESAMKTYVEKVDELKKKYGI,9905.11267969,9911.28108,,RESID:51@0,,,1
8653,TCTP_MOUSE,P63028,Translationally-controlled tumor protein,P63028,,MIIYRDLISHDELFSDIYKIREIADGLCLEVEGKMVSRTEGAIDDSLIGGNASAEGPEGEGTESTVVTGVDIVMNHHLQETSFTKEAYKKYIKDYMKSLKGKLEEQKPERVKPFMTGAAEQIKHILANFNNYQFFIGENMNPDGMVALLDYREDGVTPFMIFFKDGLEMEKC,0,171,172,MIIYRDLISHDELFSDIYKIREIADGLCLEVEGKMVSRTEGAIDDSLIGGNASAEGPEGEGTESTVVTGVDIVMNHHLQETSFTKEAYKKYIKDYMKSLKGKLEEQKPERVKPFMTGAAEQIKHILANFNNYQFFIGENMNPDGMVALLDYREDGVTPFMIFFKDGLEMEKC,19449.54892469,19462.16948,,,,,1
8654,NDUA4_MOUSE,Q62425,Cytochrome c oxidase subunit NDUFA4,Q62425,,MLRQILGQAKKHPSLIPLFVFIGAGGTGAALYVMRLALFNPDVSWDRKNNPEPWNKLGPNEQYKFYSVNVDYSKLKKEGPDF,0,81,82,MLRQILGQAKKHPSLIPLFVFIGAGGTGAALYVMRLALFNPDVSWDRKNNPEPWNKLGPNEQYKFYSVNVDYSKLKKEGPDF,9320.86796469,9326.79398,,,,,1
8655,ATPD_MOUSE,Q9D3D9,ATP synthase subunit delta; mitochondrial,Q9D3D9,,MLPASLLRHPGLRRLMLQARTYAEAAAAPAPAAGPGQMSFTFASPTQVFFDSANVKQVDVPTLTGAFGILASHVPTLQVLRPGLVVVHTEDGTTTKYFVSSGSVTVNADSSVQLLAEEAVTLDMLDLGAARANLEKAQSELSGAADEAARAEIQIRIEANEALVKALE,22,167,146,AEAAAAPAPAAGPGQMSFTFASPTQVFFDSANVKQVDVPTLTGAFGILASHVPTLQVLRPGLVVVHTEDGTTTKYFVSSGSVTVNADSSVQLLAEEAVTLDMLDLGAARANLEKAQSELSGAADEAARAEIQIRIEANEALVKALE,15014.68675469,15023.87158,,,,,1
8656,TPIS_MOUSE,P17751,Triosephosphate isomerase,P17751,,MEGKAEQQGAGLTMAEGGEKEEFCFTAIYISGQWREPCVCTDLQRLEPGTMAPTRKFFVGGNWKMNGRKKCLGELICTLNAANVPAGTEVVCAPPTAYIDFARQKLDPKIAVAAQNCYKVTNGAFTGEISPGMIKDLGATWVVLGHSERRHVFGESDELIGQKVSHALAEGLGVIACIGEKLDEREAGITEKVVFEQTKVIADNVKDWSKVVLAYEPVWAIGTGKTATPQQAQEVHEKLRGWLKSNVNDGVAQSTRIIYGGSVTGATCKELASQPDVDGFLVGGASLKPEFVDIINAKQ,51,298,248,APTRKFFVGGNWKMNGRKKCLGELICTLNAANVPAGTEVVCAPPTAYIDFARQKLDPKIAVAAQNCYKVTNGAFTGEISPGMIKDLGATWVVLGHSERRHVFGESDELIGQKVSHALAEGLGVIACIGEKLDEREAGITEKVVFEQTKVIADNVKDWSKVVLAYEPVWAIGTGKTATPQQAQEVHEKLRGWLKSNVNDGVAQSTRIIYGGSVTGATCKELASQPDVDGFLVGGASLKPEFVDIINAKQ,26564.72505469,26581.42568,,,,,1
8658,PTMS_MOUSE,Q9D0J8,Parathymosin,Q9D0J8,,MSEKSVEAAAELSAKDLKEKKDKVEEKAGRKERKKEVVEEEENGAEEEEEETAEDGEDDDEGDEEDEEEEEEDEGPVRKRTAEEEDEADPKRQKTENGASA,1,100,100,SEKSVEAAAELSAKDLKEKKDKVEEKAGRKERKKEVVEEEENGAEEEEEETAEDGEDDDEGDEEDEEEEEEDEGPVRKRTAEEEDEADPKRQKTENGASA,11334.11640969,11340.63298,,RESID:51@0,,,1
8659,HMGN1_MOUSE,P18608,Non-histone chromosomal protein HMG-14,P18608,,MPKRKVSADGAAKAEPKRRSARLSAKPAPAKVDAKPKKAAGKDKASDKKVQIKGKRGAKGKQADVADQQTTELPAENGETENQSPASEEEKEAKSD,1,95,95,PKRKVSADGAAKAEPKRRSARLSAKPAPAKVDAKPKKAAGKDKASDKKVQIKGKRGAKGKQADVADQQTTELPAENGETENQSPASEEEKEAKSD,10095.29646569,10101.17948,,RESID:38@68,,,1
8660,QIL1_MOUSE,Q8R404,Protein QIL1,Q8R404,,MVARVWSLMRFLIKGSVAGGAVYLVYDQELLGPSDKSEAALRKAEEVVPPAMYQFSQYVCQQTGLEMPQLPTPPKIKFPNFRDSWNSGIISVMSALSVAPSKAREYSKEGWEYLKEHSK,1,118,118,VARVWSLMRFLIKGSVAGGAVYLVYDQELLGPSDKSEAALRKAEEVVPPAMYQFSQYVCQQTGLEMPQLPTPPKIKFPNFRDSWNSGIISVMSALSVAPSKAREYSKEGWEYLKEHSK,13233.76268469,13242.25508,,,,,1
8661,GSTP1_MOUSE,P19157,Glutathione S-transferase P 1,P19157,,MPPYTIVYFPVRGRCEAMRMLLADQGQSWKEEVVTIDTWMQGLLKPTCLYGQLPKFEDGDLTLYQSNAILRHLGRSLGLYGKNQREAAQMDMVNDGVEDLRGKYVTLIYTNYENGKNDYVKALPGHLKPFETLLSQNQGGKAFIVGDQISFADYNLLDLLLIHQVLAPGCLDNFPLLSAYVARLSARPKIKAFLSSPEHVNRPINGNGKQ,1,209,209,PPYTIVYFPVRGRCEAMRMLLADQGQSWKEEVVTIDTWMQGLLKPTCLYGQLPKFEDGDLTLYQSNAILRHLGRSLGLYGKNQREAAQMDMVNDGVEDLRGKYVTLIYTNYENGKNDYVKALPGHLKPFETLLSQNQGGKAFIVGDQISFADYNLLDLLLIHQVLAPGCLDNFPLLSAYVARLSARPKIKAFLSSPEHVNRPINGNGKQ,23543.03874569,23557.97058,,RESID:39@107,,,1
8662,BAP31_MOUSE,Q61335,B-cell receptor-associated protein 31,Q61335,,MSLQWTTVATFLYAEVFAVLLLCIPFISPKRWQKVFKSRLVELVVTYGNTFFVVLIVILVLLVIDAVREILKYDDVTEKVNLQNNPGAMEHFHMKLFRAQRNLYIAGFSLLLSFLLRRLVTLISQQATLLASNEAFKKQAESASEAAKKYMEENDQLKKGAAEDGDKLDIGNTEMKLEENKSLKNDLRKLKDELASTKKKLEKAENEALAMQKQSEGLTKEYDRLLEEHAKLQASVRGPSVKKEE,1,244,244,SLQWTTVATFLYAEVFAVLLLCIPFISPKRWQKVFKSRLVELVVTYGNTFFVVLIVILVLLVIDAVREILKYDDVTEKVNLQNNPGAMEHFHMKLFRAQRNLYIAGFSLLLSFLLRRLVTLISQQATLLASNEAFKKQAESASEAAKKYMEENDQLKKGAAEDGDKLDIGNTEMKLEENKSLKNDLRKLKDELASTKKKLEKAENEALAMQKQSEGLTKEYDRLLEEHAKLQASVRGPSVKKEE,27807.94341469,27825.36428,,,,,1
8663,Q5FW97_MOUSE,Q5FW97,SubName: Full=Enolase 1; alpha non-neuron {ECO:0000313|EMBL:AAH39179.2};,Q5FW97,,MSILRIHAREIFDSRGNPTVEVDLYTAKGLFRAAVPSGASTGIYEALELRDNDKTRFMGKGVSQAVEHINKTIAPALVSKKVNVVEQEKIDKLMIEMDGTENKSKFGANAILGVSLAVCKAGAVEKGVPLYRHIADLAGNPEVILPVPAFNVINGGSHAGNKLAMQEFMILPVGASSFREAMRIGAEVYHNLKNVIKEKYGKDATNVGDEGGFAPNILENKEALELLKTAIAKAGYTDQVVIGMDVAASEFYRSGKYDLDFKSPDDPSRYITPDQLADLYKSFVQNYPVVSIEDPFDQDDWGAWQKFTASAGIQVVGDDLTVTNPKRIAKAASEKSCNCLLLKVNQIGSVTESLQACKLAQSNGWGVMVSHRSGETEDTFIADLVVGLCTGQIKTGAPCRSERLAKYNQILRIEEELGSKAKFAGRSFRNPLAK,1,433,433,SILRIHAREIFDSRGNPTVEVDLYTAKGLFRAAVPSGASTGIYEALELRDNDKTRFMGKGVSQAVEHINKTIAPALVSKKVNVVEQEKIDKLMIEMDGTENKSKFGANAILGVSLAVCKAGAVEKGVPLYRHIADLAGNPEVILPVPAFNVINGGSHAGNKLAMQEFMILPVGASSFREAMRIGAEVYHNLKNVIKEKYGKDATNVGDEGGFAPNILENKEALELLKTAIAKAGYTDQVVIGMDVAASEFYRSGKYDLDFKSPDDPSRYITPDQLADLYKSFVQNYPVVSIEDPFDQDDWGAWQKFTASAGIQVVGDDLTVTNPKRIAKAASEKSCNCLLLKVNQIGSVTESLQACKLAQSNGWGVMVSHRSGETEDTFIADLVVGLCTGQIKTGAPCRSERLAKYNQILRIEEELGSKAKFAGRSFRNPLAK,47022.1844296901,47051.6690799999,,RESID:51@0,,,1
8664,Q91V55_MOUSE,Q91V55,SubName: Full=40S ribosomal protein S5 {ECO:0000313|Ensembl:ENSMUSP00000004554};,Q91V55,,MTEWEAATPAVAETPDIKLFGKWSTDDVQINDISLQDYIAVKEKYAKYLPHSAGRYAAKRFRKAQCPIVERLTNSMMMHGRNNGKKLMTVRIVKHAFEIIHLLTGENPLQVLVNAIINSGPREDSTRIGRAGTVRRQAVDVSPLRRVNQAIWLLCTGAREAAFRNIKTIAECLADELINAAKGSSNSYAIKKKDELERVAKSNR,1,203,203,TEWEAATPAVAETPDIKLFGKWSTDDVQINDISLQDYIAVKEKYAKYLPHSAGRYAAKRFRKAQCPIVERLTNSMMMHGRNNGKKLMTVRIVKHAFEIIHLLTGENPLQVLVNAIINSGPREDSTRIGRAGTVRRQAVDVSPLRRVNQAIWLLCTGAREAAFRNIKTIAECLADELINAAKGSSNSYAIKKKDELERVAKSNR,22773.02207969,22787.24288,,RESID:52@0,,,1
8665,MIF_MOUSE,P34884,Macrophage migration inhibitory factor,P34884,,MPMFIVNTNVPRASVPEGFLSELTQQLAQATGKPAQYIAVHVVPDQLMTFSGTNDPCALCSLHSIGKIGGAQNRNYSKLLCGLLSDRLHISPDRVYINYYDMNAANVGWNGSTFA,1,114,114,PMFIVNTNVPRASVPEGFLSELTQQLAQATGKPAQYIAVHVVPDQLMTFSGTNDPCALCSLHSIGKIGGAQNRNYSKLLCGLLSDRLHISPDRVYINYYDMNAANVGWNGSTFA,12365.13719469,12373.07408,,,,,1
8666,Q544Z9_MOUSE,Q544Z9,SubName: Full=Cytochrome b-5; isoform CRA_d {ECO:0000313|EMBL:EDL09355.1};,Q544Z9,,MAGQSDKDVKYYTLEEIQKHKDSKSTWVILHHKVYDLTKFLEEHPGGEEVLREQAGGDATENFEDVGHSTDARELSKTYIIGELHPDDRSKIAKPSDTLITTVESNSSWWTNWVIPAISALAVALMYRLYMAED,1,133,133,AGQSDKDVKYYTLEEIQKHKDSKSTWVILHHKVYDLTKFLEEHPGGEEVLREQAGGDATENFEDVGHSTDARELSKTYIIGELHPDDRSKIAKPSDTLITTVESNSSWWTNWVIPAISALAVALMYRLYMAED,15142.50409969,15151.83838,,RESID:41@0,,,1
8667,ATP5L_MOUSE,Q9CPQ8,ATP synthase subunit g; mitochondrial,Q9CPQ8,,MAKFIRNFAEKAPSMVAAAVTYSKPRLATFWHYAKVELVPPTPAEIPTAIQSVKKIIQSAKTGSFKHLTVKEAVLNGLVATEVWMWFYIGEIIGKRGIVGYDV,1,102,102,AKFIRNFAEKAPSMVAAAVTYSKPRLATFWHYAKVELVPPTPAEIPTAIQSVKKIIQSAKTGSFKHLTVKEAVLNGLVATEVWMWFYIGEIIGKRGIVGYDV,11328.14266969,11335.35628,,RESID:41@0,,,1
8668,PRDX2_MOUSE,Q61171,Peroxiredoxin-2,Q61171,,MASGNAQIGKSAPDFTATAVVDGAFKEIKLSDYRGKYVVLFFYPLDFTFVCPTEIIAFSDHAEDFRKLGCEVLGVSVDSQFTHLAWINTPRKEGGLGPLNIPLLADVTKSLSQNYGVLKNDEGIAYRGLFIIDAKGVLRQITVNDLPVGRSVDEALRLVQAFQYTDEHGEVCPAGWKPGSDTIKPNVDDSKEYFSKHN,1,197,197,ASGNAQIGKSAPDFTATAVVDGAFKEIKLSDYRGKYVVLFFYPLDFTFVCPTEIIAFSDHAEDFRKLGCEVLGVSVDSQFTHLAWINTPRKEGGLGPLNIPLLADVTKSLSQNYGVLKNDEGIAYRGLFIIDAKGVLRQITVNDLPVGRSVDEALRLVQAFQYTDEHGEVCPAGWKPGSDTIKPNVDDSKEYFSKHN,21676.02817969,21689.51478,,RESID:41@0,,,1
8669,Q5BL14_MOUSE,Q5BL14,SubName: Full=High mobility group nucleosomal binding domain 2 {ECO:0000313|EMBL:AAH90837.1};,Q5BL14,,MPKRKAEGDAKGDKTKVKDEPQRRSARLSAKPAPPKPEPKPKKAPAKKGEKVPKGKKGKADAGKDANNPAENGDAKTDQAQKAEGAGDAK,1,89,89,PKRKAEGDAKGDKTKVKDEPQRRSARLSAKPAPPKPEPKPKKAPAKKGEKVPKGKKGKADAGKDANNPAENGDAKTDQAQKAEGAGDAK,9286.02727469,9291.50358,,,,,1
8670,Q5NCJ9_MOUSE,Q5NCJ9,SubName: Full=RIKEN cDNA 1110020P15; isoform CRA_b {ECO:0000313|EMBL:EDL40486.1};,Q5NCJ9,,MSSPTIPSRLYSLLFRRTSTFALTIAVGALFFERAFDQGADAIYEHINEGKLWKHIKHKYENKE,1,63,63,SSPTIPSRLYSLLFRRTSTFALTIAVGALFFERAFDQGADAIYEHINEGKLWKHIKHKYENKE,7351.83621969,7356.37558,,RESID:51@0,,,1
8671,GSTP1_MOUSE,P19157,Glutathione S-transferase P 1,P19157,,MPPYTIVYFPVRGRCEAMRMLLADQGQSWKEEVVTIDTWMQGLLKPTCLYGQLPKFEDGDLTLYQSNAILRHLGRSLGLYGKNQREAAQMDMVNDGVEDLRGKYVTLIYTNYENGKNDYVKALPGHLKPFETLLSQNQGGKAFIVGDQISFADYNLLDLLLIHQVLAPGCLDNFPLLSAYVARLSARPKIKAFLSSPEHVNRPINGNGKQ,1,209,209,PPYTIVYFPVRGRCEAMRMLLADQGQSWKEEVVTIDTWMQGLLKPTCLYGQLPKFEDGDLTLYQSNAILRHLGRSLGLYGKNQREAAQMDMVNDGVEDLRGKYVTLIYTNYENGKNDYVKALPGHLKPFETLLSQNQGGKAFIVGDQISFADYNLLDLLLIHQVLAPGCLDNFPLLSAYVARLSARPKIKAFLSSPEHVNRPINGNGKQ,23547.09354469,23562.07058,,RESID:55@119|RESID:55@126,,,1
8672,Q541E3_MOUSE,Q541E3,SubName: Full=Peripheral-type benzodiazepine receptor {ECO:0000313|EMBL:AAL87530.1};,Q541E3,,MPESWVPAVGLTLVPSLGGFMGAYFVRGEGLRWYASLQKPSWHPPRWTLAPIWGTLYSAMGYGSYIVWKELGGFTEDAMVPLGLYTGQLALNWAWPPIFFGARQMGWALADLLLVSGVATATTLAWHRVSPPAARLLYPYLAWLAFATVLNYYVWRDNSGRRGGSRLPE,1,168,168,PESWVPAVGLTLVPSLGGFMGAYFVRGEGLRWYASLQKPSWHPPRWTLAPIWGTLYSAMGYGSYIVWKELGGFTEDAMVPLGLYTGQLALNWAWPPIFFGARQMGWALADLLLVSGVATATTLAWHRVSPPAARLLYPYLAWLAFATVLNYYVWRDNSGRRGGSRLPE,18697.62410469,18709.66388,,,,,1
8673,Q0VGU2_MOUSE,Q0VGU2,SubName: Full=Prothymosin alpha {ECO:0000313|EMBL:AAH85171.1};,Q0VGU2,,MSDAAVDTSSEITTKDLKEKKEVVEEAENGRDAPANGNAQNEENGEQEADNEVDEEEEEGGEEEEEEEEGDGEEEDGDEDEEAEAPTGKRVAEDDEDDDVDTKKQKTEEDD,1,110,110,SDAAVDTSSEITTKDLKEKKEVVEEAENGRDAPANGNAQNEENGEQEADNEVDEEEEEGGEEEEEEEEGDGEEEDGDEDEEAEAPTGKRVAEDDEDDDVDTKKQKTEEDD,12557.85408469,12564.84338,,RESID:51@0|RESID:38@6|RESID:37@7|RESID:37@8|RESID:38@11|RESID:38@12,,,1
8674,CYB5B_MOUSE,Q9CQX2,Cytochrome b5 type B,Q9CQX2,,MATPEASGSGEKVEGSEPSVTYYRLEEVAKRNSAEETWMVIHGRVYDITRFLSEHPGGEEVLLEQAGADATESFEDVGHSPDAREMLKQYYIGDVHPSDLKPKGDDKDPSKNNSCQSSWAYWFVPIVGAILIGFLYRHFWADSKSS,1,145,145,ATPEASGSGEKVEGSEPSVTYYRLEEVAKRNSAEETWMVIHGRVYDITRFLSEHPGGEEVLLEQAGADATESFEDVGHSPDAREMLKQYYIGDVHPSDLKPKGDDKDPSKNNSCQSSWAYWFVPIVGAILIGFLYRHFWADSKSS,16218.78719969,16228.84988,,RESID:41@0,,,1
8675,B2RXM2_MOUSE,B2RXM2,SubName: Full=EG627828 protein {ECO:0000313|EMBL:AAI57905.1};,B2RXM2,,MEGHDPKEPEQLRKLFIGGLSFETTDDSLREHFEKWGTLTDCVVMRDPQTKRSRGFGFVTYSCVEEVDAAMCARPYKVDGRVVEPKRAVSREDSVKPGAHLTVKKIFVGGIKEDTEEYNLRDYFEKYGKIETIEVMEDRQSGKKRGFAFVTFDDHDTVDKIVVQKYHTINGHNCEVKKALSKQEMRSAGSQRDRGGGSGNFMGRGGNFGGGGGNFGGRGGYGGGGGGSRGSYGGGDGGYNGFGGDGGNYGGGPGYSSRGGYGGGGPGYGNQGGGYGGGGGGYDGYNEGGNFGGGNYGGGGNYNDFGNYSGQQQSNYGPMKGGSFGGRSSGSPYGGGYGSGGGSGGYGSRRF,0,350,351,MEGHDPKEPEQLRKLFIGGLSFETTDDSLREHFEKWGTLTDCVVMRDPQTKRSRGFGFVTYSCVEEVDAAMCARPYKVDGRVVEPKRAVSREDSVKPGAHLTVKKIFVGGIKEDTEEYNLRDYFEKYGKIETIEVMEDRQSGKKRGFAFVTFDDHDTVDKIVVQKYHTINGHNCEVKKALSKQEMRSAGSQRDRGGGSGNFMGRGGNFGGGGGNFGGRGGYGGGGGGSRGSYGGGDGGYNGFGGDGGNYGGGPGYSSRGGYGGGGPGYGNQGGGYGGGGGGYDGYNEGGNFGGGNYGGGGNYNDFGNYSGQQQSNYGPMKGGSFGGRSSGSPYGGGYGSGGGSGGYGSRRF,36628.98821969,36651.6495799999,,RESID:49@0,,,1
8676,SC61B_MOUSE,Q9CQS8,Protein transport protein Sec61 subunit beta,Q9CQS8,,MPGPTPSGTNVGSSGRSPSKAVAARAAGSTVRQRKNASCGTRSAGRTTSAGTGGMWRFYTEDSPGLKVGPVPVLVMSLLFIAAVFMLHIWGKYTRS,1,95,95,PGPTPSGTNVGSSGRSPSKAVAARAAGSTVRQRKNASCGTRSAGRTTSAGTGGMWRFYTEDSPGLKVGPVPVLVMSLLFIAAVFMLHIWGKYTRS,9901.02824568999,9907.24048,,RESID:37@11,,,1
8677,LDHA_MOUSE,P06151,L-lactate dehydrogenase A chain,P06151,,MATLKDQLIVNLLKEEQAPQNKITVVGVGAVGMACAISILMKDLADELALVDVMEDKLKGEMMDLQHGSLFLKTPKIVSSKDYCVTANSKLVIITAGARQQEGESRLNLVQRNVNIFKFIIPNIVKYSPHCKLLIVSNPVDILTYVAWKISGFPKNRVIGSGCNLDSARFRYLMGERLGVHALSCHGWVLGEHGDSSVPVWSGVNVAGVSLKSLNPELGTDADKEQWKEVHKQVVDSAYEVIKLKGYTSWAIGLSVADLAESIMKNLRRVHPISTMIKGLYGINEDVFLSVPCILGQNGISDVVKVTLTPEEEARLKKSADTLWGIQKELQF,1,331,331,ATLKDQLIVNLLKEEQAPQNKITVVGVGAVGMACAISILMKDLADELALVDVMEDKLKGEMMDLQHGSLFLKTPKIVSSKDYCVTANSKLVIITAGARQQEGESRLNLVQRNVNIFKFIIPNIVKYSPHCKLLIVSNPVDILTYVAWKISGFPKNRVIGSGCNLDSARFRYLMGERLGVHALSCHGWVLGEHGDSSVPVWSGVNVAGVSLKSLNPELGTDADKEQWKEVHKQVVDSAYEVIKLKGYTSWAIGLSVADLAESIMKNLRRVHPISTMIKGLYGINEDVFLSVPCILGQNGISDVVKVTLTPEEEARLKKSADTLWGIQKELQF,36386.19080969,36409.38238,,RESID:41@0,,,1
8678,E9Q7H5_MOUSE,E9Q7H5,SubName: Full=Uncharacterized protein {ECO:0000313|Ensembl:ENSMUSP00000072775};,E9Q7H5,,MEGHDPKEPEQLRKLFIGGLSFETTDDSLREHFEKWGTLTDCVVMRDPQTKRSRGFGFVTYSCVEEVDAAMCARPHKVDGRVVEPKRAVSREDSVKPGAHLTVKKIFVGGIKEDTEEYNLRDYFEKYGKIETIEVMEDRHKEKERGKKRGFAFVTFDDHDTVDKIVVQKYHTINGHNCEVKKALSKQEMQSAGSQRGRGGGSGNFMGRGGNFGGGGGNFGRGGNFGERGGYDGYNEGGNFGGGNYGGGGNYNDFGNYSGQQQSNYGPMKGGSFGGRSSGSPYGGGYGSGGGSGGYGSRRF,0,299,300,MEGHDPKEPEQLRKLFIGGLSFETTDDSLREHFEKWGTLTDCVVMRDPQTKRSRGFGFVTYSCVEEVDAAMCARPHKVDGRVVEPKRAVSREDSVKPGAHLTVKKIFVGGIKEDTEEYNLRDYFEKYGKIETIEVMEDRHKEKERGKKRGFAFVTFDDHDTVDKIVVQKYHTINGHNCEVKKALSKQEMQSAGSQRGRGGGSGNFMGRGGNFGGGGGNFGRGGNFGERGGYDGYNEGGNFGGGNYGGGGNYNDFGNYSGQQQSNYGPMKGGSFGGRSSGSPYGGGYGSGGGSGGYGSRRF,32596.51061969,32616.8099799999,,RESID:49@0,,,1
8679,Q5SQB0_MOUSE,Q5SQB0,SubName: Full=Nucleophosmin {ECO:0000313|Ensembl:ENSMUSP00000090891};,Q5SQB0,,MEDSMDMDMSPLRPQNYLFGCELKADKDYHFKVDNDENEHQLSLRTVSLGAGAKDELHIVEAEAMNYEGSPIKVTLATLKMSVQPTVSLGGFEITPPVVLRLKCGSGPVHISGQHLVAVEEDAESEDEDEEDVKLLGMSGKRSAPGGGNKVPQKKVKLDEDDEDDDEDDEDDEDDDDDDFDEEETEEKVPVKKGQESFKKQEKTPKTPKGPSSVEDIKAKMQASIEKGGSLPKVEAKFINYVKNCFRMTDQEAIQDLWQWRKSL,1,263,263,EDSMDMDMSPLRPQNYLFGCELKADKDYHFKVDNDENEHQLSLRTVSLGAGAKDELHIVEAEAMNYEGSPIKVTLATLKMSVQPTVSLGGFEITPPVVLRLKCGSGPVHISGQHLVAVEEDAESEDEDEEDVKLLGMSGKRSAPGGGNKVPQKKVKLDEDDEDDDEDDEDDEDDDDDDFDEEETEEKVPVKKGQESFKKQEKTPKTPKGPSSVEDIKAKMQASIEKGGSLPKVEAKFINYVKNCFRMTDQEAIQDLWQWRKSL,29375.16522469,29393.50898,,,,,1
8680,GSTP1_MOUSE,P19157,Glutathione S-transferase P 1,P19157,,MPPYTIVYFPVRGRCEAMRMLLADQGQSWKEEVVTIDTWMQGLLKPTCLYGQLPKFEDGDLTLYQSNAILRHLGRSLGLYGKNQREAAQMDMVNDGVEDLRGKYVTLIYTNYENGKNDYVKALPGHLKPFETLLSQNQGGKAFIVGDQISFADYNLLDLLLIHQVLAPGCLDNFPLLSAYVARLSARPKIKAFLSSPEHVNRPINGNGKQ,1,209,209,PPYTIVYFPVRGRCEAMRMLLADQGQSWKEEVVTIDTWMQGLLKPTCLYGQLPKFEDGDLTLYQSNAILRHLGRSLGLYGKNQREAAQMDMVNDGVEDLRGKYVTLIYTNYENGKNDYVKALPGHLKPFETLLSQNQGGKAFIVGDQISFADYNLLDLLLIHQVLAPGCLDNFPLLSAYVARLSARPKIKAFLSSPEHVNRPINGNGKQ,23585.04931069,23600.01058,,RESID:39@107|RESID:55@119,,,1
8681,PARK7_MOUSE,Q99LX0,Protein DJ-1,Q99LX0,,MASKRALVILAKGAEEMETVIPVDVMRRAGIKVTVAGLAGKDPVQCSRDVMICPDTSLEDAKTQGPYDVVVLPGGNLGAQNLSESPMVKEILKEQESRKGLIAAICAGPTALLAHEVGFGCKVTTHPLAKDKMMNGSHYSYSESRVEKDGLILTSRGPGTSFEFALAIVEALVGKDMANQVKAPLVLKD,1,188,188,ASKRALVILAKGAEEMETVIPVDVMRRAGIKVTVAGLAGKDPVQCSRDVMICPDTSLEDAKTQGPYDVVVLPGGNLGAQNLSESPMVKEILKEQESRKGLIAAICAGPTALLAHEVGFGCKVTTHPLAKDKMMNGSHYSYSESRVEKDGLILTSRGPGTSFEFALAIVEALVGKDMANQVKAPLVLKD,19919.35063969,19932.15278,,RESID:41@0,,,1
8682,ATP5E_MOUSE,P56382,ATP synthase subunit epsilon; mitochondrial,P56382,,MVAYWRQAGLSYIRFSQICAKAVRDALKTEFKANAEKTSGSSIKIVKVSKKE,1,51,51,VAYWRQAGLSYIRFSQICAKAVRDALKTEFKANAEKTSGSSIKIVKVSKKE,5703.10858469,5706.64968,,,,,1
8683,HMGN1_MOUSE,P18608,Non-histone chromosomal protein HMG-14,P18608,,MPKRKVSADGAAKAEPKRRSARLSAKPAPAKVDAKPKKAAGKDKASDKKVQIKGKRGAKGKQADVADQQTTELPAENGETENQSPASEEEKEAKSD,1,95,95,PKRKVSADGAAKAEPKRRSARLSAKPAPAKVDAKPKKAAGKDKASDKKVQIKGKRGAKGKQADVADQQTTELPAENGETENQSPASEEEKEAKSD,10175.26279669,10181.15948,,RESID:38@68|RESID:38@78,,,1
8684,USMG5_MOUSE,Q78IK2,Up-regulated during skeletal muscle growth protein 5,Q78IK2,,MAGAESDGQFQFTGIKKYFNSYTLTGRMNCVLATYGGIALLVLYFKLRPKKTPAVKAT,1,57,57,AGAESDGQFQFTGIKKYFNSYTLTGRMNCVLATYGGIALLVLYFKLRPKKTPAVKAT,6246.31652469,6250.32738,,,,,1
8685,G3P_MOUSE,P16858,Glyceraldehyde-3-phosphate dehydrogenase,P16858,,MVKVGVNGFGRIGRLVTRAAICSGKVEIVAINDPFIDLNYMVYMFQYDSTHGKFNGTVKAENGKLVINGKPITIFQERDPTNIKWGEAGAEYVVESTGVFTTMEKAGAHLKGGAKRVIISAPSADAPMFVMGVNHEKYDNSLKIVSNASCTTNCLAPLAKVIHDNFGIVEGLMTTVHAITATQKTVDGPSGKLWRDGRGAAQNIIPASTGAAKAVGKVIPELNGKLTGMAFRVPTPNVSVVDLTCRLEKPAKYDDIKKVVKQASEGPLKGILGYTEDQVVSCDFNSNSHSSTFDAGAGIALNDNFVKLISWYDNEYGYSNRVVDLMAYMASKE,1,332,332,VKVGVNGFGRIGRLVTRAAICSGKVEIVAINDPFIDLNYMVYMFQYDSTHGKFNGTVKAENGKLVINGKPITIFQERDPTNIKWGEAGAEYVVESTGVFTTMEKAGAHLKGGAKRVIISAPSADAPMFVMGVNHEKYDNSLKIVSNASCTTNCLAPLAKVIHDNFGIVEGLMTTVHAITATQKTVDGPSGKLWRDGRGAAQNIIPASTGAAKAVGKVIPELNGKLTGMAFRVPTPNVSVVDLTCRLEKPAKYDDIKKVVKQASEGPLKGILGYTEDQVVSCDFNSNSHSSTFDAGAGIALNDNFVKLISWYDNEYGYSNRVVDLMAYMASKE,35656.17152469,35678.82058,,,,,1
8686,S10AB_MOUSE,P50543,Protein S100-A11,P50543,,MPTETERCIESLIAVFQKYSGKDGNNTQLSKTEFLSFMNTELAAFTKNQKDPGVLDRMMKKLDLNCDGQLDFQEFLNLIGGLAIACHDSFIQTSQKRI,1,97,97,PTETERCIESLIAVFQKYSGKDGNNTQLSKTEFLSFMNTELAAFTKNQKDPGVLDRMMKKLDLNCDGQLDFQEFLNLIGGLAIACHDSFIQTSQKRI,10944.44709469,10951.48768,,,,,1
8687,ROA2_MOUSE,O88569,Heterogeneous nuclear ribonucleoproteins A2/B1,O88569-2,2,MEREKEQFRKLFIGGLSFETTEESLRNYYEQWGKLTDCVVMRDPASKRSRGFGFVTFSSMAEVDAAMAARPHSIDGRVVEPKRAVAREESGKPGAHVTVKKLFVGGIKEDTEEHHLRDYFEEYGKIDTIEIITDRQSGKKRGFGFVTFDDHDPVDKIVLQKYHTINGHNAEVRKALSRQEMQEVQSSRSGRGGNFGFGDSRGGGGNFGPGPGSNFRGGSDGYGSGRGFGDGYNGYGGGPGGGNFGGSPGYGGGRGGYGGGGPGYGNQGGGYGGGYDNYGGGNYGSGSYNDFGNYNQQPSNYGPMKSGNFGGSRNMGGPYGGGNYGPGGSGGSGGYGGRSRY,0,340,341,MEREKEQFRKLFIGGLSFETTEESLRNYYEQWGKLTDCVVMRDPASKRSRGFGFVTFSSMAEVDAAMAARPHSIDGRVVEPKRAVAREESGKPGAHVTVKKLFVGGIKEDTEEHHLRDYFEEYGKIDTIEIITDRQSGKKRGFGFVTFDDHDPVDKIVLQKYHTINGHNAEVRKALSRQEMQEVQSSRSGRGGNFGFGDSRGGGGNFGPGPGSNFRGGSDGYGSGRGFGDGYNGYGGGPGGGNFGGSPGYGGGRGGYGGGGPGYGNQGGGYGGGYDNYGGGNYGSGSYNDFGNYNQQPSNYGPMKSGNFGGSRNMGGPYGGGNYGPGGSGGSGGYGGRSRY,36040.91690969,36063.0747799999,,RESID:49@0|RESID:75@91|RESID:69@190,,,1
8688,E9Q1F2_MOUSE,E9Q1F2,SubName: Full=Actin; cytoplasmic 1 {ECO:0000313|Ensembl:ENSMUSP00000127663};,E9Q1F2,,MDDDIAALVVDNGSGMCKAGFAGDDAPRAVFPSIVGRPRHQIMFETFNTPAMYVAIQAVLSLYASGRTTGIVMDSGDGVTHTVPIYEGYALPHAILRLDLAGRDLTDYLMKILTERGYSFTTTAEREIVRDIKEKLCYVALDFEQEMATAASSSSLEKSYELPDGQVITIGNERFRCPEALFQPSFLGMESCGIHETTFNSIMKCDVDIRKDLYANTVLSGGTTMYPGIADRMQKEITALAPSTMKIKIIAPPERKYSVWIGGSILASLSTFQQMWISKQEYDESGPSIVHRKCF,1,294,294,DDDIAALVVDNGSGMCKAGFAGDDAPRAVFPSIVGRPRHQIMFETFNTPAMYVAIQAVLSLYASGRTTGIVMDSGDGVTHTVPIYEGYALPHAILRLDLAGRDLTDYLMKILTERGYSFTTTAEREIVRDIKEKLCYVALDFEQEMATAASSSSLEKSYELPDGQVITIGNERFRCPEALFQPSFLGMESCGIHETTFNSIMKCDVDIRKDLYANTVLSGGTTMYPGIADRMQKEITALAPSTMKIKIIAPPERKYSVWIGGSILASLSTFQQMWISKQEYDESGPSIVHRKCF,32454.12141969,32475.14178,,RESID:42@0,,,1
8689,GSTP1_MOUSE,P19157,Glutathione S-transferase P 1,P19157,,MPPYTIVYFPVRGRCEAMRMLLADQGQSWKEEVVTIDTWMQGLLKPTCLYGQLPKFEDGDLTLYQSNAILRHLGRSLGLYGKNQREAAQMDMVNDGVEDLRGKYVTLIYTNYENGKNDYVKALPGHLKPFETLLSQNQGGKAFIVGDQISFADYNLLDLLLIHQVLAPGCLDNFPLLSAYVARLSARPKIKAFLSSPEHVNRPINGNGKQ,1,209,209,PPYTIVYFPVRGRCEAMRMLLADQGQSWKEEVVTIDTWMQGLLKPTCLYGQLPKFEDGDLTLYQSNAILRHLGRSLGLYGKNQREAAQMDMVNDGVEDLRGKYVTLIYTNYENGKNDYVKALPGHLKPFETLLSQNQGGKAFIVGDQISFADYNLLDLLLIHQVLAPGCLDNFPLLSAYVARLSARPKIKAFLSSPEHVNRPINGNGKQ,23627.05987569,23642.05058,,RESID:39@107|RESID:55@119|RESID:55@126,,,1
8690,ARPC5_MOUSE,Q9CPW4,Actin-related protein 2/3 complex subunit 5,Q9CPW4,,MSKNTVSSARFRKVDVDEYDENKFVDEEDGGDGQAGPDEGEVDSCLRQGNMTAALQAALKNPPINTKSQAVKDRAGSIVLKVLISFKANDIEKAVQSLDKNGVDLLMKYIYKGFESPSDNSSAVLLQWHEKALAAGGVGSIVRVLTARKTV,1,150,150,SKNTVSSARFRKVDVDEYDENKFVDEEDGGDGQAGPDEGEVDSCLRQGNMTAALQAALKNPPINTKSQAVKDRAGSIVLKVLISFKANDIEKAVQSLDKNGVDLLMKYIYKGFESPSDNSSAVLLQWHEKALAAGGVGSIVRVLTARKTV,16189.29692969,16199.20818,,RESID:51@0,,,1